123456789101112131415161718192021222324252627282930313233343536373839404142434445464748495051525354555657585960616263646566676869707172737475767778798081828384858687888990919293949596979899100101102103104105106107108109110111112113114115116117118119120121122123124125126127128129130131132133134135136137138139140141142143144145146147148149150151152153154155156157158159160161162163164165166167168169170171172173174175176177178179180181182183184185186187188189190191192193194195196197198199200201202203204205206207208209210211212213214215216217218219220221222223224225226227228229230231232233234235236237238239240241242243244245246247248249250251252253254255256257258259260261262263264265266267268269270271272273274275276277278279280281282283284285286287288289290291292293294295296297298299300301302303304305306307308309310311312313314315316317318319320321322323324325326327328329330331332333334335336337338339340341342343344345346347348349350351352353354355356357358359360361362363364365366367368369370371372373374375376377378379380381382383384385386387388389390391392393394395396397398399400401402403404405406407408409410411412413414415416417418419420421422423424425426427428429430431432433434435436437438439440441442443444445446447448449450451452453454455456457458459460461462463464465466467468469470471472473474475476477478479480481482483484485486487488489490491492493494495496497498499500501502503504505506507508509510511512513514515516517518519520521522523524525526527528529530531532533534535536537538539540541542543544545546547548549550551552553554555556557558559560561562563564565566567568569570571572573574575576577578579580581582583584585586587588589590591592593594595596597598599600601602603604605606607608609610611612613614615616617618619620621622623624625626627628629630631632633634635636637638639640641642643644645646647648649650651652653654655656657658659660661662663664665666667668669670671672673674675676677678679680681682683684685686687688689690691692693694695696697698699700701702703704705706707708709710711712713714715716717718719720721722723724725726727728729730731732733734735736737738739740741742743744745746747748749750751752753754755756757758759760761762763764765766767768769770771772773774775776777778779780781782783784785786787788789790791792793794795796797798799800801802803804805806807808809810811812813814815816817818819820821822823824825826827828829830831832833834835836837838839840841842843844845846847848849850851852853854855856857858859860861862863864865866867868869870871872873874875876877878879880881882883884885886887888889890891892893894895896897898899900901902903904905906907908909910911912913914915916917918919920921922923924925926927928929930931932933934935936937938939940941942943944945946947948949950951952953954955956957958959960961962963964965966967968969970971972973974975976977978979980981982983984985986987988989990991992993994995996997998999100010011002100310041005100610071008100910101011101210131014101510161017101810191020102110221023102410251026102710281029103010311032103310341035103610371038103910401041104210431044104510461047104810491050105110521053105410551056105710581059106010611062106310641065106610671068106910701071107210731074107510761077107810791080108110821083108410851086108710881089109010911092109310941095109610971098109911001101110211031104110511061107110811091110111111121113111411151116111711181119112011211122112311241125112611271128112911301131113211331134113511361137113811391140114111421143114411451146114711481149115011511152115311541155115611571158115911601161116211631164116511661167116811691170117111721173117411751176117711781179118011811182118311841185118611871188118911901191119211931194119511961197119811991200120112021203120412051206120712081209121012111212121312141215121612171218121912201221122212231224122512261227122812291230123112321233123412351236123712381239124012411242124312441245124612471248124912501251125212531254125512561257125812591260126112621263126412651266126712681269127012711272127312741275127612771278127912801281128212831284128512861287128812891290129112921293129412951296129712981299130013011302130313041305130613071308130913101311131213131314131513161317131813191320132113221323132413251326132713281329133013311332133313341335133613371338133913401341134213431344134513461347134813491350135113521353135413551356135713581359136013611362136313641365136613671368136913701371137213731374137513761377137813791380138113821383138413851386138713881389139013911392139313941395139613971398139914001401140214031404140514061407140814091410141114121413141414151416141714181419142014211422142314241425142614271428142914301431143214331434143514361437143814391440144114421443144414451446144714481449145014511452145314541455145614571458145914601461146214631464146514661467146814691470147114721473147414751476147714781479148014811482148314841485148614871488148914901491149214931494149514961497149814991500150115021503150415051506150715081509151015111512151315141515151615171518151915201521152215231524152515261527152815291530153115321533153415351536153715381539154015411542154315441545154615471548154915501551155215531554155515561557155815591560156115621563156415651566156715681569157015711572157315741575157615771578157915801581158215831584158515861587158815891590159115921593159415951596159715981599160016011602160316041605160616071608160916101611161216131614161516161617161816191620162116221623162416251626162716281629163016311632163316341635163616371638163916401641164216431644164516461647164816491650165116521653165416551656165716581659166016611662166316641665166616671668166916701671167216731674167516761677167816791680168116821683168416851686168716881689169016911692169316941695169616971698169917001701170217031704170517061707170817091710171117121713171417151716171717181719172017211722172317241725172617271728172917301731173217331734173517361737173817391740174117421743174417451746174717481749175017511752175317541755175617571758175917601761176217631764176517661767176817691770177117721773177417751776177717781779178017811782178317841785178617871788178917901791179217931794179517961797179817991800180118021803180418051806180718081809181018111812181318141815181618171818181918201821182218231824182518261827182818291830183118321833183418351836183718381839184018411842184318441845184618471848184918501851185218531854185518561857185818591860186118621863186418651866186718681869187018711872187318741875187618771878187918801881188218831884188518861887188818891890189118921893189418951896189718981899190019011902190319041905 |
- This file contains any messages produced by compilers while
- running configure, to aid debugging if configure makes a mistake.
- It was created by tpm2-tss configure 3.2.0, which was
- generated by GNU Autoconf 2.69. Invocation command line was
- $ ./configure --host=arm-linux-gnueabihf --prefix=/opt/ti-processor-sdk-linux-am335x-evm-04.02.00.09/EVSE/GPL/tpm2-tss-3.2.0/release CC=/opt/ti-processor-sdk-linux-am335x-evm-04.02.00.09/linux-devkit/sysroots/x86_64-arago-linux/usr/bin/arm-linux-gnueabihf-gcc AR=/opt/ti-processor-sdk-linux-am335x-evm-04.02.00.09/linux-devkit/sysroots/x86_64-arago-linux/usr/bin/arm-linux-gnueabihf-ar RANLIB=/opt/ti-processor-sdk-linux-am335x-evm-04.02.00.09/linux-devkit/sysroots/x86_64-arago-linux/usr/bin/arm-linux-gnueabihf-ranlib STRIP=/opt/ti-processor-sdk-linux-am335x-evm-04.02.00.09/linux-devkit/sysroots/x86_64-arago-linux/usr/bin/arm-linux-gnueabihf-strip CXX=/opt/ti-processor-sdk-linux-am335x-evm-04.02.00.09/linux-devkit/sysroots/x86_64-arago-linux/usr/bin/arm-linux-gnueabihf-g++ LD=/opt/ti-processor-sdk-linux-am335x-evm-04.02.00.09/linux-devkit/sysroots/x86_64-arago-linux/usr/bin/arm-linux-gnueabihf-ld CRYPTO_CFLAGS=-I/opt/ti-processor-sdk-linux-am335x-evm-04.02.00.09/EVSE/GPL/openssl-1.1.1n/release/include CRYPTO_LIBS=-L/opt/ti-processor-sdk-linux-am335x-evm-04.02.00.09/EVSE/GPL/openssl-1.1.1n/release/lib -lssl -lcrypto JSONC_CFLAGS=-I/opt/ti-processor-sdk-linux-am335x-evm-04.02.00.09/EVSE/GPL/json-c-json-c-0.13.1-20180305/release/include JSONC_LIBS=-L/opt/ti-processor-sdk-linux-am335x-evm-04.02.00.09/EVSE/GPL/json-c-json-c-0.13.1-20180305/release/lib -ljson-c CURL_CFLAGS=-I/opt/ti-processor-sdk-linux-am335x-evm-04.02.00.09/EVSE/GPL/curl-7.61.1/release/include CURL_LIBS=-L/opt/ti-processor-sdk-linux-am335x-evm-04.02.00.09/EVSE/GPL/curl-7.61.1/release/lib -lcurl --disable-doxygen-doc --disable-doxygen-man --disable-doxygen-rtf --disable-doxygen-html --disable-tcti-swtpm
- ## --------- ##
- ## Platform. ##
- ## --------- ##
- hostname = csu4-platform
- uname -m = x86_64
- uname -r = 4.15.0-193-generic
- uname -s = Linux
- uname -v = #204-Ubuntu SMP Fri Aug 26 19:20:21 UTC 2022
- /usr/bin/uname -p = unknown
- /bin/uname -X = unknown
- /bin/arch = unknown
- /usr/bin/arch -k = unknown
- /usr/convex/getsysinfo = unknown
- /usr/bin/hostinfo = unknown
- /bin/machine = unknown
- /usr/bin/oslevel = unknown
- /bin/universe = unknown
- PATH: /bin
- PATH: /sbin
- PATH: /usr/bin
- PATH: /opt/ti-processor-sdk-linux-am335x-evm-04.02.00.09/linux-devkit/sysroots/armv7ahf-neon-linux-gnueabi/usr/bin
- PATH: usr/bin
- PATH: ATH
- ## ----------- ##
- ## Core tests. ##
- ## ----------- ##
- configure:2790: checking for a BSD-compatible install
- configure:2858: result: /usr/bin/install -c
- configure:2869: checking whether build environment is sane
- configure:2924: result: yes
- configure:2983: checking for arm-linux-gnueabihf-strip
- configure:3010: result: /opt/ti-processor-sdk-linux-am335x-evm-04.02.00.09/linux-devkit/sysroots/x86_64-arago-linux/usr/bin/arm-linux-gnueabihf-strip
- configure:3075: checking for a thread-safe mkdir -p
- configure:3114: result: /bin/mkdir -p
- configure:3121: checking for gawk
- configure:3137: found /usr/bin/gawk
- configure:3148: result: gawk
- configure:3159: checking whether make sets $(MAKE)
- configure:3181: result: yes
- configure:3210: checking whether make supports nested variables
- configure:3227: result: yes
- configure:3364: checking whether make supports nested variables
- configure:3381: result: yes
- configure:3407: checking build system type
- configure:3421: result: x86_64-pc-linux-gnu
- configure:3441: checking host system type
- configure:3454: result: arm-unknown-linux-gnueabihf
- configure:3492: checking whether to enable debugging
- configure:3554: result: no
- configure:3592: checking for arm-linux-gnueabihf-gcc
- configure:3619: result: /opt/ti-processor-sdk-linux-am335x-evm-04.02.00.09/linux-devkit/sysroots/x86_64-arago-linux/usr/bin/arm-linux-gnueabihf-gcc
- configure:3888: checking for C compiler version
- configure:3897: /opt/ti-processor-sdk-linux-am335x-evm-04.02.00.09/linux-devkit/sysroots/x86_64-arago-linux/usr/bin/arm-linux-gnueabihf-gcc --version >&5
- arm-linux-gnueabihf-gcc (Linaro GCC 6.2-2016.11) 6.2.1 20161016
- Copyright (C) 2016 Free Software Foundation, Inc.
- This is free software; see the source for copying conditions. There is NO
- warranty; not even for MERCHANTABILITY or FITNESS FOR A PARTICULAR PURPOSE.
- configure:3908: $? = 0
- configure:3897: /opt/ti-processor-sdk-linux-am335x-evm-04.02.00.09/linux-devkit/sysroots/x86_64-arago-linux/usr/bin/arm-linux-gnueabihf-gcc -v >&5
- Using built-in specs.
- COLLECT_GCC=/opt/ti-processor-sdk-linux-am335x-evm-04.02.00.09/linux-devkit/sysroots/x86_64-arago-linux/usr/bin/arm-linux-gnueabihf-gcc
- COLLECT_LTO_WRAPPER=/opt/ti-processor-sdk-linux-am335x-evm-04.02.00.09/linux-devkit/sysroots/x86_64-arago-linux/usr/bin/../libexec/gcc/arm-linux-gnueabihf/6.2.1/lto-wrapper
- Target: arm-linux-gnueabihf
- Configured with: /home/tcwg-buildslave/workspace/tcwg-make-release/label/docker-trusty-amd64-tcwg-build/target/arm-linux-gnueabihf/snapshots/gcc-linaro-6.2-2016.11/configure SHELL=/bin/bash --with-mpc=/home/tcwg-buildslave/workspace/tcwg-make-release/label/docker-trusty-amd64-tcwg-build/target/arm-linux-gnueabihf/_build/builds/destdir/x86_64-unknown-linux-gnu --with-mpfr=/home/tcwg-buildslave/workspace/tcwg-make-release/label/docker-trusty-amd64-tcwg-build/target/arm-linux-gnueabihf/_build/builds/destdir/x86_64-unknown-linux-gnu --with-gmp=/home/tcwg-buildslave/workspace/tcwg-make-release/label/docker-trusty-amd64-tcwg-build/target/arm-linux-gnueabihf/_build/builds/destdir/x86_64-unknown-linux-gnu --with-gnu-as --with-gnu-ld --disable-libstdcxx-pch --disable-libmudflap --with-cloog=no --with-ppl=no --with-isl=no --disable-nls --enable-c99 --enable-gnu-indirect-function --disable-multilib --with-tune=cortex-a9 --with-arch=armv7-a --with-fpu=vfpv3-d16 --with-float=hard --with-mode=thumb --enable-multiarch --with-build-sysroot=/home/tcwg-buildslave/workspace/tcwg-make-release/label/docker-trusty-amd64-tcwg-build/target/arm-linux-gnueabihf/_build/sysroots/arm-linux-gnueabihf --enable-lto --enable-linker-build-id --enable-long-long --enable-shared --with-sysroot=/home/tcwg-buildslave/workspace/tcwg-make-release/label/docker-trusty-amd64-tcwg-build/target/arm-linux-gnueabihf/_build/builds/destdir/x86_64-unknown-linux-gnu/arm-linux-gnueabihf/libc --enable-languages=c,c++,fortran,lto --enable-checking=release --disable-bootstrap --build=x86_64-unknown-linux-gnu --host=x86_64-unknown-linux-gnu --target=arm-linux-gnueabihf --prefix=/home/tcwg-buildslave/workspace/tcwg-make-release/label/docker-trusty-amd64-tcwg-build/target/arm-linux-gnueabihf/_build/builds/destdir/x86_64-unknown-linux-gnu
- Thread model: posix
- gcc version 6.2.1 20161016 (Linaro GCC 6.2-2016.11)
- configure:3908: $? = 0
- configure:3897: /opt/ti-processor-sdk-linux-am335x-evm-04.02.00.09/linux-devkit/sysroots/x86_64-arago-linux/usr/bin/arm-linux-gnueabihf-gcc -V >&5
- arm-linux-gnueabihf-gcc: error: unrecognized command line option '-V'
- arm-linux-gnueabihf-gcc: fatal error: no input files
- compilation terminated.
- configure:3908: $? = 1
- configure:3897: /opt/ti-processor-sdk-linux-am335x-evm-04.02.00.09/linux-devkit/sysroots/x86_64-arago-linux/usr/bin/arm-linux-gnueabihf-gcc -qversion >&5
- arm-linux-gnueabihf-gcc: error: unrecognized command line option '-qversion'; did you mean '--version'?
- arm-linux-gnueabihf-gcc: fatal error: no input files
- compilation terminated.
- configure:3908: $? = 1
- configure:3928: checking whether the C compiler works
- configure:3950: /opt/ti-processor-sdk-linux-am335x-evm-04.02.00.09/linux-devkit/sysroots/x86_64-arago-linux/usr/bin/arm-linux-gnueabihf-gcc conftest.c >&5
- configure:3954: $? = 0
- configure:4002: result: yes
- configure:4005: checking for C compiler default output file name
- configure:4007: result: a.out
- configure:4013: checking for suffix of executables
- configure:4020: /opt/ti-processor-sdk-linux-am335x-evm-04.02.00.09/linux-devkit/sysroots/x86_64-arago-linux/usr/bin/arm-linux-gnueabihf-gcc -o conftest conftest.c >&5
- configure:4024: $? = 0
- configure:4046: result:
- configure:4068: checking whether we are cross compiling
- configure:4076: /opt/ti-processor-sdk-linux-am335x-evm-04.02.00.09/linux-devkit/sysroots/x86_64-arago-linux/usr/bin/arm-linux-gnueabihf-gcc -o conftest conftest.c >&5
- configure:4080: $? = 0
- configure:4087: ./conftest
- ./configure: line 4089: ./conftest: cannot execute binary file: Exec format error
- configure:4091: $? = 126
- configure:4106: result: yes
- configure:4111: checking for suffix of object files
- configure:4133: /opt/ti-processor-sdk-linux-am335x-evm-04.02.00.09/linux-devkit/sysroots/x86_64-arago-linux/usr/bin/arm-linux-gnueabihf-gcc -c conftest.c >&5
- configure:4137: $? = 0
- configure:4158: result: o
- configure:4162: checking whether we are using the GNU C compiler
- configure:4181: /opt/ti-processor-sdk-linux-am335x-evm-04.02.00.09/linux-devkit/sysroots/x86_64-arago-linux/usr/bin/arm-linux-gnueabihf-gcc -c conftest.c >&5
- configure:4181: $? = 0
- configure:4190: result: yes
- configure:4199: checking whether /opt/ti-processor-sdk-linux-am335x-evm-04.02.00.09/linux-devkit/sysroots/x86_64-arago-linux/usr/bin/arm-linux-gnueabihf-gcc accepts -g
- configure:4219: /opt/ti-processor-sdk-linux-am335x-evm-04.02.00.09/linux-devkit/sysroots/x86_64-arago-linux/usr/bin/arm-linux-gnueabihf-gcc -c -g conftest.c >&5
- configure:4219: $? = 0
- configure:4260: result: yes
- configure:4277: checking for /opt/ti-processor-sdk-linux-am335x-evm-04.02.00.09/linux-devkit/sysroots/x86_64-arago-linux/usr/bin/arm-linux-gnueabihf-gcc option to accept ISO C89
- configure:4340: /opt/ti-processor-sdk-linux-am335x-evm-04.02.00.09/linux-devkit/sysroots/x86_64-arago-linux/usr/bin/arm-linux-gnueabihf-gcc -c conftest.c >&5
- configure:4340: $? = 0
- configure:4353: result: none needed
- configure:4378: checking whether /opt/ti-processor-sdk-linux-am335x-evm-04.02.00.09/linux-devkit/sysroots/x86_64-arago-linux/usr/bin/arm-linux-gnueabihf-gcc understands -c and -o together
- configure:4400: /opt/ti-processor-sdk-linux-am335x-evm-04.02.00.09/linux-devkit/sysroots/x86_64-arago-linux/usr/bin/arm-linux-gnueabihf-gcc -c conftest.c -o conftest2.o
- configure:4403: $? = 0
- configure:4400: /opt/ti-processor-sdk-linux-am335x-evm-04.02.00.09/linux-devkit/sysroots/x86_64-arago-linux/usr/bin/arm-linux-gnueabihf-gcc -c conftest.c -o conftest2.o
- configure:4403: $? = 0
- configure:4415: result: yes
- configure:4435: checking whether make supports the include directive
- configure:4450: make -f confmf.GNU && cat confinc.out
- make[1]: Entering directory '/opt/ti-processor-sdk-linux-am335x-evm-04.02.00.09/EVSE/GPL/tpm2-tss-3.2.0'
- make[1]: Leaving directory '/opt/ti-processor-sdk-linux-am335x-evm-04.02.00.09/EVSE/GPL/tpm2-tss-3.2.0'
- this is the am__doit target
- configure:4453: $? = 0
- configure:4472: result: yes (GNU style)
- configure:4497: checking dependency style of /opt/ti-processor-sdk-linux-am335x-evm-04.02.00.09/linux-devkit/sysroots/x86_64-arago-linux/usr/bin/arm-linux-gnueabihf-gcc
- configure:4608: result: gcc3
- configure:4735: checking for C++ compiler version
- configure:4744: /opt/ti-processor-sdk-linux-am335x-evm-04.02.00.09/linux-devkit/sysroots/x86_64-arago-linux/usr/bin/arm-linux-gnueabihf-g++ --version >&5
- arm-linux-gnueabihf-g++ (Linaro GCC 6.2-2016.11) 6.2.1 20161016
- Copyright (C) 2016 Free Software Foundation, Inc.
- This is free software; see the source for copying conditions. There is NO
- warranty; not even for MERCHANTABILITY or FITNESS FOR A PARTICULAR PURPOSE.
- configure:4755: $? = 0
- configure:4744: /opt/ti-processor-sdk-linux-am335x-evm-04.02.00.09/linux-devkit/sysroots/x86_64-arago-linux/usr/bin/arm-linux-gnueabihf-g++ -v >&5
- Using built-in specs.
- COLLECT_GCC=/opt/ti-processor-sdk-linux-am335x-evm-04.02.00.09/linux-devkit/sysroots/x86_64-arago-linux/usr/bin/arm-linux-gnueabihf-g++
- COLLECT_LTO_WRAPPER=/opt/ti-processor-sdk-linux-am335x-evm-04.02.00.09/linux-devkit/sysroots/x86_64-arago-linux/usr/bin/../libexec/gcc/arm-linux-gnueabihf/6.2.1/lto-wrapper
- Target: arm-linux-gnueabihf
- Configured with: /home/tcwg-buildslave/workspace/tcwg-make-release/label/docker-trusty-amd64-tcwg-build/target/arm-linux-gnueabihf/snapshots/gcc-linaro-6.2-2016.11/configure SHELL=/bin/bash --with-mpc=/home/tcwg-buildslave/workspace/tcwg-make-release/label/docker-trusty-amd64-tcwg-build/target/arm-linux-gnueabihf/_build/builds/destdir/x86_64-unknown-linux-gnu --with-mpfr=/home/tcwg-buildslave/workspace/tcwg-make-release/label/docker-trusty-amd64-tcwg-build/target/arm-linux-gnueabihf/_build/builds/destdir/x86_64-unknown-linux-gnu --with-gmp=/home/tcwg-buildslave/workspace/tcwg-make-release/label/docker-trusty-amd64-tcwg-build/target/arm-linux-gnueabihf/_build/builds/destdir/x86_64-unknown-linux-gnu --with-gnu-as --with-gnu-ld --disable-libstdcxx-pch --disable-libmudflap --with-cloog=no --with-ppl=no --with-isl=no --disable-nls --enable-c99 --enable-gnu-indirect-function --disable-multilib --with-tune=cortex-a9 --with-arch=armv7-a --with-fpu=vfpv3-d16 --with-float=hard --with-mode=thumb --enable-multiarch --with-build-sysroot=/home/tcwg-buildslave/workspace/tcwg-make-release/label/docker-trusty-amd64-tcwg-build/target/arm-linux-gnueabihf/_build/sysroots/arm-linux-gnueabihf --enable-lto --enable-linker-build-id --enable-long-long --enable-shared --with-sysroot=/home/tcwg-buildslave/workspace/tcwg-make-release/label/docker-trusty-amd64-tcwg-build/target/arm-linux-gnueabihf/_build/builds/destdir/x86_64-unknown-linux-gnu/arm-linux-gnueabihf/libc --enable-languages=c,c++,fortran,lto --enable-checking=release --disable-bootstrap --build=x86_64-unknown-linux-gnu --host=x86_64-unknown-linux-gnu --target=arm-linux-gnueabihf --prefix=/home/tcwg-buildslave/workspace/tcwg-make-release/label/docker-trusty-amd64-tcwg-build/target/arm-linux-gnueabihf/_build/builds/destdir/x86_64-unknown-linux-gnu
- Thread model: posix
- gcc version 6.2.1 20161016 (Linaro GCC 6.2-2016.11)
- configure:4755: $? = 0
- configure:4744: /opt/ti-processor-sdk-linux-am335x-evm-04.02.00.09/linux-devkit/sysroots/x86_64-arago-linux/usr/bin/arm-linux-gnueabihf-g++ -V >&5
- arm-linux-gnueabihf-g++: error: unrecognized command line option '-V'
- arm-linux-gnueabihf-g++: fatal error: no input files
- compilation terminated.
- configure:4755: $? = 1
- configure:4744: /opt/ti-processor-sdk-linux-am335x-evm-04.02.00.09/linux-devkit/sysroots/x86_64-arago-linux/usr/bin/arm-linux-gnueabihf-g++ -qversion >&5
- arm-linux-gnueabihf-g++: error: unrecognized command line option '-qversion'; did you mean '--version'?
- arm-linux-gnueabihf-g++: fatal error: no input files
- compilation terminated.
- configure:4755: $? = 1
- configure:4759: checking whether we are using the GNU C++ compiler
- configure:4778: /opt/ti-processor-sdk-linux-am335x-evm-04.02.00.09/linux-devkit/sysroots/x86_64-arago-linux/usr/bin/arm-linux-gnueabihf-g++ -c conftest.cpp >&5
- configure:4778: $? = 0
- configure:4787: result: yes
- configure:4796: checking whether /opt/ti-processor-sdk-linux-am335x-evm-04.02.00.09/linux-devkit/sysroots/x86_64-arago-linux/usr/bin/arm-linux-gnueabihf-g++ accepts -g
- configure:4816: /opt/ti-processor-sdk-linux-am335x-evm-04.02.00.09/linux-devkit/sysroots/x86_64-arago-linux/usr/bin/arm-linux-gnueabihf-g++ -c -g conftest.cpp >&5
- configure:4816: $? = 0
- configure:4857: result: yes
- configure:4882: checking dependency style of /opt/ti-processor-sdk-linux-am335x-evm-04.02.00.09/linux-devkit/sysroots/x86_64-arago-linux/usr/bin/arm-linux-gnueabihf-g++
- configure:4993: result: gcc3
- configure:5008: checking whether ln -s works
- configure:5012: result: yes
- configure:5025: checking how to run the C preprocessor
- configure:5056: /opt/ti-processor-sdk-linux-am335x-evm-04.02.00.09/linux-devkit/sysroots/x86_64-arago-linux/usr/bin/arm-linux-gnueabihf-gcc -E conftest.c
- configure:5056: $? = 0
- configure:5070: /opt/ti-processor-sdk-linux-am335x-evm-04.02.00.09/linux-devkit/sysroots/x86_64-arago-linux/usr/bin/arm-linux-gnueabihf-gcc -E conftest.c
- conftest.c:12:28: fatal error: ac_nonexistent.h: No such file or directory
- #include <ac_nonexistent.h>
- ^
- compilation terminated.
- configure:5070: $? = 1
- configure: failed program was:
- | /* confdefs.h */
- | #define PACKAGE_NAME "tpm2-tss"
- | #define PACKAGE_TARNAME "tpm2-tss"
- | #define PACKAGE_VERSION "3.2.0"
- | #define PACKAGE_STRING "tpm2-tss 3.2.0"
- | #define PACKAGE_BUGREPORT "https://github.com/tpm2-software/tpm2-tss/issues"
- | #define PACKAGE_URL "https://github.com/tpm2-software/tpm2-tss"
- | #define PACKAGE "tpm2-tss"
- | #define VERSION "3.2.0"
- | #define NDEBUG 1
- | /* end confdefs.h. */
- | #include <ac_nonexistent.h>
- configure:5095: result: /opt/ti-processor-sdk-linux-am335x-evm-04.02.00.09/linux-devkit/sysroots/x86_64-arago-linux/usr/bin/arm-linux-gnueabihf-gcc -E
- configure:5115: /opt/ti-processor-sdk-linux-am335x-evm-04.02.00.09/linux-devkit/sysroots/x86_64-arago-linux/usr/bin/arm-linux-gnueabihf-gcc -E conftest.c
- configure:5115: $? = 0
- configure:5129: /opt/ti-processor-sdk-linux-am335x-evm-04.02.00.09/linux-devkit/sysroots/x86_64-arago-linux/usr/bin/arm-linux-gnueabihf-gcc -E conftest.c
- conftest.c:12:28: fatal error: ac_nonexistent.h: No such file or directory
- #include <ac_nonexistent.h>
- ^
- compilation terminated.
- configure:5129: $? = 1
- configure: failed program was:
- | /* confdefs.h */
- | #define PACKAGE_NAME "tpm2-tss"
- | #define PACKAGE_TARNAME "tpm2-tss"
- | #define PACKAGE_VERSION "3.2.0"
- | #define PACKAGE_STRING "tpm2-tss 3.2.0"
- | #define PACKAGE_BUGREPORT "https://github.com/tpm2-software/tpm2-tss/issues"
- | #define PACKAGE_URL "https://github.com/tpm2-software/tpm2-tss"
- | #define PACKAGE "tpm2-tss"
- | #define VERSION "3.2.0"
- | #define NDEBUG 1
- | /* end confdefs.h. */
- | #include <ac_nonexistent.h>
- configure:5158: checking for grep that handles long lines and -e
- configure:5216: result: /bin/grep
- configure:5221: checking for egrep
- configure:5283: result: /bin/grep -E
- configure:5288: checking for ANSI C header files
- configure:5308: /opt/ti-processor-sdk-linux-am335x-evm-04.02.00.09/linux-devkit/sysroots/x86_64-arago-linux/usr/bin/arm-linux-gnueabihf-gcc -c conftest.c >&5
- configure:5308: $? = 0
- configure:5392: result: yes
- configure:5405: checking for sys/types.h
- configure:5405: /opt/ti-processor-sdk-linux-am335x-evm-04.02.00.09/linux-devkit/sysroots/x86_64-arago-linux/usr/bin/arm-linux-gnueabihf-gcc -c conftest.c >&5
- configure:5405: $? = 0
- configure:5405: result: yes
- configure:5405: checking for sys/stat.h
- configure:5405: /opt/ti-processor-sdk-linux-am335x-evm-04.02.00.09/linux-devkit/sysroots/x86_64-arago-linux/usr/bin/arm-linux-gnueabihf-gcc -c conftest.c >&5
- configure:5405: $? = 0
- configure:5405: result: yes
- configure:5405: checking for stdlib.h
- configure:5405: /opt/ti-processor-sdk-linux-am335x-evm-04.02.00.09/linux-devkit/sysroots/x86_64-arago-linux/usr/bin/arm-linux-gnueabihf-gcc -c conftest.c >&5
- configure:5405: $? = 0
- configure:5405: result: yes
- configure:5405: checking for string.h
- configure:5405: /opt/ti-processor-sdk-linux-am335x-evm-04.02.00.09/linux-devkit/sysroots/x86_64-arago-linux/usr/bin/arm-linux-gnueabihf-gcc -c conftest.c >&5
- configure:5405: $? = 0
- configure:5405: result: yes
- configure:5405: checking for memory.h
- configure:5405: /opt/ti-processor-sdk-linux-am335x-evm-04.02.00.09/linux-devkit/sysroots/x86_64-arago-linux/usr/bin/arm-linux-gnueabihf-gcc -c conftest.c >&5
- configure:5405: $? = 0
- configure:5405: result: yes
- configure:5405: checking for strings.h
- configure:5405: /opt/ti-processor-sdk-linux-am335x-evm-04.02.00.09/linux-devkit/sysroots/x86_64-arago-linux/usr/bin/arm-linux-gnueabihf-gcc -c conftest.c >&5
- configure:5405: $? = 0
- configure:5405: result: yes
- configure:5405: checking for inttypes.h
- configure:5405: /opt/ti-processor-sdk-linux-am335x-evm-04.02.00.09/linux-devkit/sysroots/x86_64-arago-linux/usr/bin/arm-linux-gnueabihf-gcc -c conftest.c >&5
- configure:5405: $? = 0
- configure:5405: result: yes
- configure:5405: checking for stdint.h
- configure:5405: /opt/ti-processor-sdk-linux-am335x-evm-04.02.00.09/linux-devkit/sysroots/x86_64-arago-linux/usr/bin/arm-linux-gnueabihf-gcc -c conftest.c >&5
- configure:5405: $? = 0
- configure:5405: result: yes
- configure:5405: checking for unistd.h
- configure:5405: /opt/ti-processor-sdk-linux-am335x-evm-04.02.00.09/linux-devkit/sysroots/x86_64-arago-linux/usr/bin/arm-linux-gnueabihf-gcc -c conftest.c >&5
- configure:5405: $? = 0
- configure:5405: result: yes
- configure:5418: checking minix/config.h usability
- configure:5418: /opt/ti-processor-sdk-linux-am335x-evm-04.02.00.09/linux-devkit/sysroots/x86_64-arago-linux/usr/bin/arm-linux-gnueabihf-gcc -c conftest.c >&5
- conftest.c:55:26: fatal error: minix/config.h: No such file or directory
- #include <minix/config.h>
- ^
- compilation terminated.
- configure:5418: $? = 1
- configure: failed program was:
- | /* confdefs.h */
- | #define PACKAGE_NAME "tpm2-tss"
- | #define PACKAGE_TARNAME "tpm2-tss"
- | #define PACKAGE_VERSION "3.2.0"
- | #define PACKAGE_STRING "tpm2-tss 3.2.0"
- | #define PACKAGE_BUGREPORT "https://github.com/tpm2-software/tpm2-tss/issues"
- | #define PACKAGE_URL "https://github.com/tpm2-software/tpm2-tss"
- | #define PACKAGE "tpm2-tss"
- | #define VERSION "3.2.0"
- | #define NDEBUG 1
- | #define STDC_HEADERS 1
- | #define HAVE_SYS_TYPES_H 1
- | #define HAVE_SYS_STAT_H 1
- | #define HAVE_STDLIB_H 1
- | #define HAVE_STRING_H 1
- | #define HAVE_MEMORY_H 1
- | #define HAVE_STRINGS_H 1
- | #define HAVE_INTTYPES_H 1
- | #define HAVE_STDINT_H 1
- | #define HAVE_UNISTD_H 1
- | /* end confdefs.h. */
- | #include <stdio.h>
- | #ifdef HAVE_SYS_TYPES_H
- | # include <sys/types.h>
- | #endif
- | #ifdef HAVE_SYS_STAT_H
- | # include <sys/stat.h>
- | #endif
- | #ifdef STDC_HEADERS
- | # include <stdlib.h>
- | # include <stddef.h>
- | #else
- | # ifdef HAVE_STDLIB_H
- | # include <stdlib.h>
- | # endif
- | #endif
- | #ifdef HAVE_STRING_H
- | # if !defined STDC_HEADERS && defined HAVE_MEMORY_H
- | # include <memory.h>
- | # endif
- | # include <string.h>
- | #endif
- | #ifdef HAVE_STRINGS_H
- | # include <strings.h>
- | #endif
- | #ifdef HAVE_INTTYPES_H
- | # include <inttypes.h>
- | #endif
- | #ifdef HAVE_STDINT_H
- | # include <stdint.h>
- | #endif
- | #ifdef HAVE_UNISTD_H
- | # include <unistd.h>
- | #endif
- | #include <minix/config.h>
- configure:5418: result: no
- configure:5418: checking minix/config.h presence
- configure:5418: /opt/ti-processor-sdk-linux-am335x-evm-04.02.00.09/linux-devkit/sysroots/x86_64-arago-linux/usr/bin/arm-linux-gnueabihf-gcc -E conftest.c
- conftest.c:22:26: fatal error: minix/config.h: No such file or directory
- #include <minix/config.h>
- ^
- compilation terminated.
- configure:5418: $? = 1
- configure: failed program was:
- | /* confdefs.h */
- | #define PACKAGE_NAME "tpm2-tss"
- | #define PACKAGE_TARNAME "tpm2-tss"
- | #define PACKAGE_VERSION "3.2.0"
- | #define PACKAGE_STRING "tpm2-tss 3.2.0"
- | #define PACKAGE_BUGREPORT "https://github.com/tpm2-software/tpm2-tss/issues"
- | #define PACKAGE_URL "https://github.com/tpm2-software/tpm2-tss"
- | #define PACKAGE "tpm2-tss"
- | #define VERSION "3.2.0"
- | #define NDEBUG 1
- | #define STDC_HEADERS 1
- | #define HAVE_SYS_TYPES_H 1
- | #define HAVE_SYS_STAT_H 1
- | #define HAVE_STDLIB_H 1
- | #define HAVE_STRING_H 1
- | #define HAVE_MEMORY_H 1
- | #define HAVE_STRINGS_H 1
- | #define HAVE_INTTYPES_H 1
- | #define HAVE_STDINT_H 1
- | #define HAVE_UNISTD_H 1
- | /* end confdefs.h. */
- | #include <minix/config.h>
- configure:5418: result: no
- configure:5418: checking for minix/config.h
- configure:5418: result: no
- configure:5439: checking whether it is safe to define __EXTENSIONS__
- configure:5457: /opt/ti-processor-sdk-linux-am335x-evm-04.02.00.09/linux-devkit/sysroots/x86_64-arago-linux/usr/bin/arm-linux-gnueabihf-gcc -c conftest.c >&5
- configure:5457: $? = 0
- configure:5464: result: yes
- configure:5524: checking how to print strings
- configure:5551: result: printf
- configure:5572: checking for a sed that does not truncate output
- configure:5636: result: /bin/sed
- configure:5654: checking for fgrep
- configure:5716: result: /bin/grep -F
- configure:5751: checking for ld used by /opt/ti-processor-sdk-linux-am335x-evm-04.02.00.09/linux-devkit/sysroots/x86_64-arago-linux/usr/bin/arm-linux-gnueabihf-gcc
- configure:5818: result: /opt/ti-processor-sdk-linux-am335x-evm-04.02.00.09/linux-devkit/sysroots/x86_64-arago-linux/usr/bin/arm-linux-gnueabihf-ld
- configure:5825: checking if the linker (/opt/ti-processor-sdk-linux-am335x-evm-04.02.00.09/linux-devkit/sysroots/x86_64-arago-linux/usr/bin/arm-linux-gnueabihf-ld) is GNU ld
- configure:5840: result: yes
- configure:5852: checking for BSD- or MS-compatible name lister (nm)
- configure:5906: result: no
- configure:5920: checking for arm-linux-gnueabihf-dumpbin
- configure:5950: result: no
- configure:5920: checking for arm-linux-gnueabihf-link
- configure:5950: result: no
- configure:5964: checking for dumpbin
- configure:5994: result: no
- configure:5964: checking for link
- configure:5980: found /usr/bin/link
- configure:5991: result: link -dump
- configure:6007: WARNING: using cross tools not prefixed with host triplet
- configure:6036: checking the name lister (nm) interface
- configure:6043: /opt/ti-processor-sdk-linux-am335x-evm-04.02.00.09/linux-devkit/sysroots/x86_64-arago-linux/usr/bin/arm-linux-gnueabihf-gcc -c conftest.c >&5
- configure:6046: nm "conftest.o"
- configure:6049: output
- 00000000 b $d
- 00000000 B some_variable
- configure:6056: result: BSD nm
- configure:6060: checking the maximum length of command line arguments
- configure:6191: result: 1572864
- configure:6239: checking how to convert x86_64-pc-linux-gnu file names to arm-unknown-linux-gnueabihf format
- configure:6279: result: func_convert_file_noop
- configure:6286: checking how to convert x86_64-pc-linux-gnu file names to toolchain format
- configure:6306: result: func_convert_file_noop
- configure:6313: checking for /opt/ti-processor-sdk-linux-am335x-evm-04.02.00.09/linux-devkit/sysroots/x86_64-arago-linux/usr/bin/arm-linux-gnueabihf-ld option to reload object files
- configure:6320: result: -r
- configure:6354: checking for arm-linux-gnueabihf-objdump
- configure:6384: result: no
- configure:6394: checking for objdump
- configure:6410: found /usr/bin/objdump
- configure:6421: result: objdump
- configure:6453: checking how to recognize dependent libraries
- configure:6653: result: pass_all
- configure:6698: checking for arm-linux-gnueabihf-dlltool
- configure:6728: result: no
- configure:6738: checking for dlltool
- configure:6768: result: no
- configure:6798: checking how to associate runtime and link libraries
- configure:6825: result: printf %s\n
- configure:6841: checking for arm-linux-gnueabihf-ar
- configure:6868: result: /opt/ti-processor-sdk-linux-am335x-evm-04.02.00.09/linux-devkit/sysroots/x86_64-arago-linux/usr/bin/arm-linux-gnueabihf-ar
- configure:6949: checking for archiver @FILE support
- configure:6966: /opt/ti-processor-sdk-linux-am335x-evm-04.02.00.09/linux-devkit/sysroots/x86_64-arago-linux/usr/bin/arm-linux-gnueabihf-gcc -c conftest.c >&5
- configure:6966: $? = 0
- configure:6969: /opt/ti-processor-sdk-linux-am335x-evm-04.02.00.09/linux-devkit/sysroots/x86_64-arago-linux/usr/bin/arm-linux-gnueabihf-ar cr libconftest.a @conftest.lst >&5
- configure:6972: $? = 0
- configure:6977: /opt/ti-processor-sdk-linux-am335x-evm-04.02.00.09/linux-devkit/sysroots/x86_64-arago-linux/usr/bin/arm-linux-gnueabihf-ar cr libconftest.a @conftest.lst >&5
- /opt/ti-processor-sdk-linux-am335x-evm-04.02.00.09/linux-devkit/sysroots/x86_64-arago-linux/usr/bin/arm-linux-gnueabihf-ar: conftest.o: No such file or directory
- configure:6980: $? = 1
- configure:6992: result: @
- configure:7010: checking for arm-linux-gnueabihf-strip
- configure:7037: result: /opt/ti-processor-sdk-linux-am335x-evm-04.02.00.09/linux-devkit/sysroots/x86_64-arago-linux/usr/bin/arm-linux-gnueabihf-strip
- configure:7109: checking for arm-linux-gnueabihf-ranlib
- configure:7136: result: /opt/ti-processor-sdk-linux-am335x-evm-04.02.00.09/linux-devkit/sysroots/x86_64-arago-linux/usr/bin/arm-linux-gnueabihf-ranlib
- configure:7278: checking command to parse nm output from /opt/ti-processor-sdk-linux-am335x-evm-04.02.00.09/linux-devkit/sysroots/x86_64-arago-linux/usr/bin/arm-linux-gnueabihf-gcc object
- configure:7431: /opt/ti-processor-sdk-linux-am335x-evm-04.02.00.09/linux-devkit/sysroots/x86_64-arago-linux/usr/bin/arm-linux-gnueabihf-gcc -c conftest.c >&5
- configure:7434: $? = 0
- configure:7438: nm conftest.o | sed -n -e 's/^.*[ ]\([ABCDGIRSTW][ABCDGIRSTW]*\)[ ][ ]*\([_A-Za-z][_A-Za-z0-9]*\)$/\1 \2 \2/p' | sed '/ __gnu_lto/d' > conftest.nm
- configure:7504: /opt/ti-processor-sdk-linux-am335x-evm-04.02.00.09/linux-devkit/sysroots/x86_64-arago-linux/usr/bin/arm-linux-gnueabihf-gcc -o conftest conftest.c conftstm.o >&5
- configure:7507: $? = 0
- configure:7545: result: ok
- configure:7592: checking for sysroot
- configure:7622: result: no
- configure:7629: checking for a working dd
- configure:7667: result: /bin/dd
- configure:7671: checking how to truncate binary pipes
- configure:7686: result: /bin/dd bs=4096 count=1
- configure:7975: checking for arm-linux-gnueabihf-mt
- configure:8005: result: no
- configure:8015: checking for mt
- configure:8031: found /bin/mt
- configure:8042: result: mt
- configure:8065: checking if mt is a manifest tool
- configure:8071: mt '-?'
- configure:8079: result: no
- configure:8753: checking for dlfcn.h
- configure:8753: /opt/ti-processor-sdk-linux-am335x-evm-04.02.00.09/linux-devkit/sysroots/x86_64-arago-linux/usr/bin/arm-linux-gnueabihf-gcc -c conftest.c >&5
- configure:8753: $? = 0
- configure:8753: result: yes
- configure:9020: checking for objdir
- configure:9035: result: .libs
- configure:9299: checking if /opt/ti-processor-sdk-linux-am335x-evm-04.02.00.09/linux-devkit/sysroots/x86_64-arago-linux/usr/bin/arm-linux-gnueabihf-gcc supports -fno-rtti -fno-exceptions
- configure:9317: /opt/ti-processor-sdk-linux-am335x-evm-04.02.00.09/linux-devkit/sysroots/x86_64-arago-linux/usr/bin/arm-linux-gnueabihf-gcc -c -fno-rtti -fno-exceptions conftest.c >&5
- cc1: warning: command line option '-fno-rtti' is valid for C++/ObjC++ but not for C
- configure:9321: $? = 0
- configure:9334: result: no
- configure:9698: checking for /opt/ti-processor-sdk-linux-am335x-evm-04.02.00.09/linux-devkit/sysroots/x86_64-arago-linux/usr/bin/arm-linux-gnueabihf-gcc option to produce PIC
- configure:9705: result: -fPIC -DPIC
- configure:9713: checking if /opt/ti-processor-sdk-linux-am335x-evm-04.02.00.09/linux-devkit/sysroots/x86_64-arago-linux/usr/bin/arm-linux-gnueabihf-gcc PIC flag -fPIC -DPIC works
- configure:9731: /opt/ti-processor-sdk-linux-am335x-evm-04.02.00.09/linux-devkit/sysroots/x86_64-arago-linux/usr/bin/arm-linux-gnueabihf-gcc -c -fPIC -DPIC -DPIC conftest.c >&5
- configure:9735: $? = 0
- configure:9748: result: yes
- configure:9777: checking if /opt/ti-processor-sdk-linux-am335x-evm-04.02.00.09/linux-devkit/sysroots/x86_64-arago-linux/usr/bin/arm-linux-gnueabihf-gcc static flag -static works
- configure:9805: result: yes
- configure:9820: checking if /opt/ti-processor-sdk-linux-am335x-evm-04.02.00.09/linux-devkit/sysroots/x86_64-arago-linux/usr/bin/arm-linux-gnueabihf-gcc supports -c -o file.o
- configure:9841: /opt/ti-processor-sdk-linux-am335x-evm-04.02.00.09/linux-devkit/sysroots/x86_64-arago-linux/usr/bin/arm-linux-gnueabihf-gcc -c -o out/conftest2.o conftest.c >&5
- configure:9845: $? = 0
- configure:9867: result: yes
- configure:9875: checking if /opt/ti-processor-sdk-linux-am335x-evm-04.02.00.09/linux-devkit/sysroots/x86_64-arago-linux/usr/bin/arm-linux-gnueabihf-gcc supports -c -o file.o
- configure:9922: result: yes
- configure:9955: checking whether the /opt/ti-processor-sdk-linux-am335x-evm-04.02.00.09/linux-devkit/sysroots/x86_64-arago-linux/usr/bin/arm-linux-gnueabihf-gcc linker (/opt/ti-processor-sdk-linux-am335x-evm-04.02.00.09/linux-devkit/sysroots/x86_64-arago-linux/usr/bin/arm-linux-gnueabihf-ld) supports shared libraries
- configure:11218: result: yes
- configure:11255: checking whether -lc should be explicitly linked in
- configure:11263: /opt/ti-processor-sdk-linux-am335x-evm-04.02.00.09/linux-devkit/sysroots/x86_64-arago-linux/usr/bin/arm-linux-gnueabihf-gcc -c conftest.c >&5
- configure:11266: $? = 0
- configure:11281: /opt/ti-processor-sdk-linux-am335x-evm-04.02.00.09/linux-devkit/sysroots/x86_64-arago-linux/usr/bin/arm-linux-gnueabihf-gcc -shared -fPIC -DPIC conftest.o -v -Wl,-soname -Wl,conftest -o conftest 2\>\&1 \| /bin/grep -lc \>/dev/null 2\>\&1
- configure:11284: $? = 0
- configure:11298: result: no
- configure:11458: checking dynamic linker characteristics
- configure:12039: /opt/ti-processor-sdk-linux-am335x-evm-04.02.00.09/linux-devkit/sysroots/x86_64-arago-linux/usr/bin/arm-linux-gnueabihf-gcc -o conftest -Wl,-rpath -Wl,/foo conftest.c >&5
- configure:12039: $? = 0
- configure:12288: result: GNU/Linux ld.so
- configure:12410: checking how to hardcode library paths into programs
- configure:12435: result: immediate
- configure:12983: checking whether stripping libraries is possible
- configure:12988: result: yes
- configure:13023: checking if libtool supports shared libraries
- configure:13025: result: yes
- configure:13028: checking whether to build shared libraries
- configure:13053: result: yes
- configure:13056: checking whether to build static libraries
- configure:13060: result: yes
- configure:13083: checking how to run the C++ preprocessor
- configure:13110: /opt/ti-processor-sdk-linux-am335x-evm-04.02.00.09/linux-devkit/sysroots/x86_64-arago-linux/usr/bin/arm-linux-gnueabihf-g++ -E conftest.cpp
- configure:13110: $? = 0
- configure:13124: /opt/ti-processor-sdk-linux-am335x-evm-04.02.00.09/linux-devkit/sysroots/x86_64-arago-linux/usr/bin/arm-linux-gnueabihf-g++ -E conftest.cpp
- conftest.cpp:29:28: fatal error: ac_nonexistent.h: No such file or directory
- #include <ac_nonexistent.h>
- ^
- compilation terminated.
- configure:13124: $? = 1
- configure: failed program was:
- | /* confdefs.h */
- | #define PACKAGE_NAME "tpm2-tss"
- | #define PACKAGE_TARNAME "tpm2-tss"
- | #define PACKAGE_VERSION "3.2.0"
- | #define PACKAGE_STRING "tpm2-tss 3.2.0"
- | #define PACKAGE_BUGREPORT "https://github.com/tpm2-software/tpm2-tss/issues"
- | #define PACKAGE_URL "https://github.com/tpm2-software/tpm2-tss"
- | #define PACKAGE "tpm2-tss"
- | #define VERSION "3.2.0"
- | #define NDEBUG 1
- | #define STDC_HEADERS 1
- | #define HAVE_SYS_TYPES_H 1
- | #define HAVE_SYS_STAT_H 1
- | #define HAVE_STDLIB_H 1
- | #define HAVE_STRING_H 1
- | #define HAVE_MEMORY_H 1
- | #define HAVE_STRINGS_H 1
- | #define HAVE_INTTYPES_H 1
- | #define HAVE_STDINT_H 1
- | #define HAVE_UNISTD_H 1
- | #define __EXTENSIONS__ 1
- | #define _ALL_SOURCE 1
- | #define _GNU_SOURCE 1
- | #define _POSIX_PTHREAD_SEMANTICS 1
- | #define _TANDEM_SOURCE 1
- | #define HAVE_DLFCN_H 1
- | #define LT_OBJDIR ".libs/"
- | /* end confdefs.h. */
- | #include <ac_nonexistent.h>
- configure:13149: result: /opt/ti-processor-sdk-linux-am335x-evm-04.02.00.09/linux-devkit/sysroots/x86_64-arago-linux/usr/bin/arm-linux-gnueabihf-g++ -E
- configure:13169: /opt/ti-processor-sdk-linux-am335x-evm-04.02.00.09/linux-devkit/sysroots/x86_64-arago-linux/usr/bin/arm-linux-gnueabihf-g++ -E conftest.cpp
- configure:13169: $? = 0
- configure:13183: /opt/ti-processor-sdk-linux-am335x-evm-04.02.00.09/linux-devkit/sysroots/x86_64-arago-linux/usr/bin/arm-linux-gnueabihf-g++ -E conftest.cpp
- conftest.cpp:29:28: fatal error: ac_nonexistent.h: No such file or directory
- #include <ac_nonexistent.h>
- ^
- compilation terminated.
- configure:13183: $? = 1
- configure: failed program was:
- | /* confdefs.h */
- | #define PACKAGE_NAME "tpm2-tss"
- | #define PACKAGE_TARNAME "tpm2-tss"
- | #define PACKAGE_VERSION "3.2.0"
- | #define PACKAGE_STRING "tpm2-tss 3.2.0"
- | #define PACKAGE_BUGREPORT "https://github.com/tpm2-software/tpm2-tss/issues"
- | #define PACKAGE_URL "https://github.com/tpm2-software/tpm2-tss"
- | #define PACKAGE "tpm2-tss"
- | #define VERSION "3.2.0"
- | #define NDEBUG 1
- | #define STDC_HEADERS 1
- | #define HAVE_SYS_TYPES_H 1
- | #define HAVE_SYS_STAT_H 1
- | #define HAVE_STDLIB_H 1
- | #define HAVE_STRING_H 1
- | #define HAVE_MEMORY_H 1
- | #define HAVE_STRINGS_H 1
- | #define HAVE_INTTYPES_H 1
- | #define HAVE_STDINT_H 1
- | #define HAVE_UNISTD_H 1
- | #define __EXTENSIONS__ 1
- | #define _ALL_SOURCE 1
- | #define _GNU_SOURCE 1
- | #define _POSIX_PTHREAD_SEMANTICS 1
- | #define _TANDEM_SOURCE 1
- | #define HAVE_DLFCN_H 1
- | #define LT_OBJDIR ".libs/"
- | /* end confdefs.h. */
- | #include <ac_nonexistent.h>
- configure:13345: checking for ld used by /opt/ti-processor-sdk-linux-am335x-evm-04.02.00.09/linux-devkit/sysroots/x86_64-arago-linux/usr/bin/arm-linux-gnueabihf-g++
- configure:13412: result: /opt/ti-processor-sdk-linux-am335x-evm-04.02.00.09/linux-devkit/sysroots/x86_64-arago-linux/usr/bin/arm-linux-gnueabihf-ld
- configure:13419: checking if the linker (/opt/ti-processor-sdk-linux-am335x-evm-04.02.00.09/linux-devkit/sysroots/x86_64-arago-linux/usr/bin/arm-linux-gnueabihf-ld) is GNU ld
- configure:13434: result: yes
- configure:13489: checking whether the /opt/ti-processor-sdk-linux-am335x-evm-04.02.00.09/linux-devkit/sysroots/x86_64-arago-linux/usr/bin/arm-linux-gnueabihf-g++ linker (/opt/ti-processor-sdk-linux-am335x-evm-04.02.00.09/linux-devkit/sysroots/x86_64-arago-linux/usr/bin/arm-linux-gnueabihf-ld) supports shared libraries
- configure:14562: result: yes
- configure:14598: /opt/ti-processor-sdk-linux-am335x-evm-04.02.00.09/linux-devkit/sysroots/x86_64-arago-linux/usr/bin/arm-linux-gnueabihf-g++ -c conftest.cpp >&5
- configure:14601: $? = 0
- configure:15082: checking for /opt/ti-processor-sdk-linux-am335x-evm-04.02.00.09/linux-devkit/sysroots/x86_64-arago-linux/usr/bin/arm-linux-gnueabihf-g++ option to produce PIC
- configure:15089: result: -fPIC -DPIC
- configure:15097: checking if /opt/ti-processor-sdk-linux-am335x-evm-04.02.00.09/linux-devkit/sysroots/x86_64-arago-linux/usr/bin/arm-linux-gnueabihf-g++ PIC flag -fPIC -DPIC works
- configure:15115: /opt/ti-processor-sdk-linux-am335x-evm-04.02.00.09/linux-devkit/sysroots/x86_64-arago-linux/usr/bin/arm-linux-gnueabihf-g++ -c -fPIC -DPIC -DPIC conftest.cpp >&5
- configure:15119: $? = 0
- configure:15132: result: yes
- configure:15155: checking if /opt/ti-processor-sdk-linux-am335x-evm-04.02.00.09/linux-devkit/sysroots/x86_64-arago-linux/usr/bin/arm-linux-gnueabihf-g++ static flag -static works
- configure:15183: result: yes
- configure:15195: checking if /opt/ti-processor-sdk-linux-am335x-evm-04.02.00.09/linux-devkit/sysroots/x86_64-arago-linux/usr/bin/arm-linux-gnueabihf-g++ supports -c -o file.o
- configure:15216: /opt/ti-processor-sdk-linux-am335x-evm-04.02.00.09/linux-devkit/sysroots/x86_64-arago-linux/usr/bin/arm-linux-gnueabihf-g++ -c -o out/conftest2.o conftest.cpp >&5
- configure:15220: $? = 0
- configure:15242: result: yes
- configure:15247: checking if /opt/ti-processor-sdk-linux-am335x-evm-04.02.00.09/linux-devkit/sysroots/x86_64-arago-linux/usr/bin/arm-linux-gnueabihf-g++ supports -c -o file.o
- configure:15294: result: yes
- configure:15324: checking whether the /opt/ti-processor-sdk-linux-am335x-evm-04.02.00.09/linux-devkit/sysroots/x86_64-arago-linux/usr/bin/arm-linux-gnueabihf-g++ linker (/opt/ti-processor-sdk-linux-am335x-evm-04.02.00.09/linux-devkit/sysroots/x86_64-arago-linux/usr/bin/arm-linux-gnueabihf-ld) supports shared libraries
- configure:15367: result: yes
- configure:15508: checking dynamic linker characteristics
- configure:16265: result: GNU/Linux ld.so
- configure:16330: checking how to hardcode library paths into programs
- configure:16355: result: immediate
- configure:16429: checking for library containing dlopen
- configure:16460: /opt/ti-processor-sdk-linux-am335x-evm-04.02.00.09/linux-devkit/sysroots/x86_64-arago-linux/usr/bin/arm-linux-gnueabihf-gcc -o conftest conftest.c >&5
- /tmp/cczNxlD8.o: In function `main':
- conftest.c:(.text+0x4): undefined reference to `dlopen'
- collect2: error: ld returned 1 exit status
- configure:16460: $? = 1
- configure: failed program was:
- | /* confdefs.h */
- | #define PACKAGE_NAME "tpm2-tss"
- | #define PACKAGE_TARNAME "tpm2-tss"
- | #define PACKAGE_VERSION "3.2.0"
- | #define PACKAGE_STRING "tpm2-tss 3.2.0"
- | #define PACKAGE_BUGREPORT "https://github.com/tpm2-software/tpm2-tss/issues"
- | #define PACKAGE_URL "https://github.com/tpm2-software/tpm2-tss"
- | #define PACKAGE "tpm2-tss"
- | #define VERSION "3.2.0"
- | #define NDEBUG 1
- | #define STDC_HEADERS 1
- | #define HAVE_SYS_TYPES_H 1
- | #define HAVE_SYS_STAT_H 1
- | #define HAVE_STDLIB_H 1
- | #define HAVE_STRING_H 1
- | #define HAVE_MEMORY_H 1
- | #define HAVE_STRINGS_H 1
- | #define HAVE_INTTYPES_H 1
- | #define HAVE_STDINT_H 1
- | #define HAVE_UNISTD_H 1
- | #define __EXTENSIONS__ 1
- | #define _ALL_SOURCE 1
- | #define _GNU_SOURCE 1
- | #define _POSIX_PTHREAD_SEMANTICS 1
- | #define _TANDEM_SOURCE 1
- | #define HAVE_DLFCN_H 1
- | #define LT_OBJDIR ".libs/"
- | /* end confdefs.h. */
- |
- | /* Override any GCC internal prototype to avoid an error.
- | Use char because int might match the return type of a GCC
- | builtin and then its argument prototype would still apply. */
- | #ifdef __cplusplus
- | extern "C"
- | #endif
- | char dlopen ();
- | int
- | main ()
- | {
- | return dlopen ();
- | ;
- | return 0;
- | }
- configure:16460: /opt/ti-processor-sdk-linux-am335x-evm-04.02.00.09/linux-devkit/sysroots/x86_64-arago-linux/usr/bin/arm-linux-gnueabihf-gcc -o conftest conftest.c -ldl >&5
- configure:16460: $? = 0
- configure:16477: result: -ldl
- configure:16567: checking for dlerror
- configure:16567: /opt/ti-processor-sdk-linux-am335x-evm-04.02.00.09/linux-devkit/sysroots/x86_64-arago-linux/usr/bin/arm-linux-gnueabihf-gcc -o conftest conftest.c -ldl -ldl >&5
- configure:16567: $? = 0
- configure:16567: result: yes
- configure:16581: checking for shl_load
- configure:16581: /opt/ti-processor-sdk-linux-am335x-evm-04.02.00.09/linux-devkit/sysroots/x86_64-arago-linux/usr/bin/arm-linux-gnueabihf-gcc -o conftest conftest.c -ldl >&5
- /tmp/ccrNC3Jb.o: In function `main':
- conftest.c:(.text+0x4): undefined reference to `shl_load'
- collect2: error: ld returned 1 exit status
- configure:16581: $? = 1
- configure: failed program was:
- | /* confdefs.h */
- | #define PACKAGE_NAME "tpm2-tss"
- | #define PACKAGE_TARNAME "tpm2-tss"
- | #define PACKAGE_VERSION "3.2.0"
- | #define PACKAGE_STRING "tpm2-tss 3.2.0"
- | #define PACKAGE_BUGREPORT "https://github.com/tpm2-software/tpm2-tss/issues"
- | #define PACKAGE_URL "https://github.com/tpm2-software/tpm2-tss"
- | #define PACKAGE "tpm2-tss"
- | #define VERSION "3.2.0"
- | #define NDEBUG 1
- | #define STDC_HEADERS 1
- | #define HAVE_SYS_TYPES_H 1
- | #define HAVE_SYS_STAT_H 1
- | #define HAVE_STDLIB_H 1
- | #define HAVE_STRING_H 1
- | #define HAVE_MEMORY_H 1
- | #define HAVE_STRINGS_H 1
- | #define HAVE_INTTYPES_H 1
- | #define HAVE_STDINT_H 1
- | #define HAVE_UNISTD_H 1
- | #define __EXTENSIONS__ 1
- | #define _ALL_SOURCE 1
- | #define _GNU_SOURCE 1
- | #define _POSIX_PTHREAD_SEMANTICS 1
- | #define _TANDEM_SOURCE 1
- | #define HAVE_DLFCN_H 1
- | #define LT_OBJDIR ".libs/"
- | #define HAVE_LIBDL 1
- | #define HAVE_DLERROR 1
- | /* end confdefs.h. */
- | /* Define shl_load to an innocuous variant, in case <limits.h> declares shl_load.
- | For example, HP-UX 11i <limits.h> declares gettimeofday. */
- | #define shl_load innocuous_shl_load
- |
- | /* System header to define __stub macros and hopefully few prototypes,
- | which can conflict with char shl_load (); below.
- | Prefer <limits.h> to <assert.h> if __STDC__ is defined, since
- | <limits.h> exists even on freestanding compilers. */
- |
- | #ifdef __STDC__
- | # include <limits.h>
- | #else
- | # include <assert.h>
- | #endif
- |
- | #undef shl_load
- |
- | /* Override any GCC internal prototype to avoid an error.
- | Use char because int might match the return type of a GCC
- | builtin and then its argument prototype would still apply. */
- | #ifdef __cplusplus
- | extern "C"
- | #endif
- | char shl_load ();
- | /* The GNU C library defines this for functions which it implements
- | to always fail with ENOSYS. Some functions are actually named
- | something starting with __ and the normal name is an alias. */
- | #if defined __stub_shl_load || defined __stub___shl_load
- | choke me
- | #endif
- |
- | int
- | main ()
- | {
- | return shl_load ();
- | ;
- | return 0;
- | }
- configure:16581: result: no
- configure:16588: checking for shl_load in -ldld
- configure:16613: /opt/ti-processor-sdk-linux-am335x-evm-04.02.00.09/linux-devkit/sysroots/x86_64-arago-linux/usr/bin/arm-linux-gnueabihf-gcc -o conftest conftest.c -ldld -ldl >&5
- /opt/ti-processor-sdk-linux-am335x-evm-04.02.00.09/linux-devkit/sysroots/x86_64-arago-linux/usr/bin/../lib/gcc/arm-linux-gnueabihf/6.2.1/../../../../arm-linux-gnueabihf/bin/ld: cannot find -ldld
- collect2: error: ld returned 1 exit status
- configure:16613: $? = 1
- configure: failed program was:
- | /* confdefs.h */
- | #define PACKAGE_NAME "tpm2-tss"
- | #define PACKAGE_TARNAME "tpm2-tss"
- | #define PACKAGE_VERSION "3.2.0"
- | #define PACKAGE_STRING "tpm2-tss 3.2.0"
- | #define PACKAGE_BUGREPORT "https://github.com/tpm2-software/tpm2-tss/issues"
- | #define PACKAGE_URL "https://github.com/tpm2-software/tpm2-tss"
- | #define PACKAGE "tpm2-tss"
- | #define VERSION "3.2.0"
- | #define NDEBUG 1
- | #define STDC_HEADERS 1
- | #define HAVE_SYS_TYPES_H 1
- | #define HAVE_SYS_STAT_H 1
- | #define HAVE_STDLIB_H 1
- | #define HAVE_STRING_H 1
- | #define HAVE_MEMORY_H 1
- | #define HAVE_STRINGS_H 1
- | #define HAVE_INTTYPES_H 1
- | #define HAVE_STDINT_H 1
- | #define HAVE_UNISTD_H 1
- | #define __EXTENSIONS__ 1
- | #define _ALL_SOURCE 1
- | #define _GNU_SOURCE 1
- | #define _POSIX_PTHREAD_SEMANTICS 1
- | #define _TANDEM_SOURCE 1
- | #define HAVE_DLFCN_H 1
- | #define LT_OBJDIR ".libs/"
- | #define HAVE_LIBDL 1
- | #define HAVE_DLERROR 1
- | /* end confdefs.h. */
- |
- | /* Override any GCC internal prototype to avoid an error.
- | Use char because int might match the return type of a GCC
- | builtin and then its argument prototype would still apply. */
- | #ifdef __cplusplus
- | extern "C"
- | #endif
- | char shl_load ();
- | int
- | main ()
- | {
- | return shl_load ();
- | ;
- | return 0;
- | }
- configure:16622: result: no
- configure:16668: checking for dld_link in -ldld
- configure:16693: /opt/ti-processor-sdk-linux-am335x-evm-04.02.00.09/linux-devkit/sysroots/x86_64-arago-linux/usr/bin/arm-linux-gnueabihf-gcc -o conftest conftest.c -ldld -ldl >&5
- /opt/ti-processor-sdk-linux-am335x-evm-04.02.00.09/linux-devkit/sysroots/x86_64-arago-linux/usr/bin/../lib/gcc/arm-linux-gnueabihf/6.2.1/../../../../arm-linux-gnueabihf/bin/ld: cannot find -ldld
- collect2: error: ld returned 1 exit status
- configure:16693: $? = 1
- configure: failed program was:
- | /* confdefs.h */
- | #define PACKAGE_NAME "tpm2-tss"
- | #define PACKAGE_TARNAME "tpm2-tss"
- | #define PACKAGE_VERSION "3.2.0"
- | #define PACKAGE_STRING "tpm2-tss 3.2.0"
- | #define PACKAGE_BUGREPORT "https://github.com/tpm2-software/tpm2-tss/issues"
- | #define PACKAGE_URL "https://github.com/tpm2-software/tpm2-tss"
- | #define PACKAGE "tpm2-tss"
- | #define VERSION "3.2.0"
- | #define NDEBUG 1
- | #define STDC_HEADERS 1
- | #define HAVE_SYS_TYPES_H 1
- | #define HAVE_SYS_STAT_H 1
- | #define HAVE_STDLIB_H 1
- | #define HAVE_STRING_H 1
- | #define HAVE_MEMORY_H 1
- | #define HAVE_STRINGS_H 1
- | #define HAVE_INTTYPES_H 1
- | #define HAVE_STDINT_H 1
- | #define HAVE_UNISTD_H 1
- | #define __EXTENSIONS__ 1
- | #define _ALL_SOURCE 1
- | #define _GNU_SOURCE 1
- | #define _POSIX_PTHREAD_SEMANTICS 1
- | #define _TANDEM_SOURCE 1
- | #define HAVE_DLFCN_H 1
- | #define LT_OBJDIR ".libs/"
- | #define HAVE_LIBDL 1
- | #define HAVE_DLERROR 1
- | /* end confdefs.h. */
- |
- | /* Override any GCC internal prototype to avoid an error.
- | Use char because int might match the return type of a GCC
- | builtin and then its argument prototype would still apply. */
- | #ifdef __cplusplus
- | extern "C"
- | #endif
- | char dld_link ();
- | int
- | main ()
- | {
- | return dld_link ();
- | ;
- | return 0;
- | }
- configure:16702: result: no
- configure:16911: checking for arm-linux-gnueabihf-pkg-config
- configure:16944: result: no
- configure:16954: checking for pkg-config
- configure:16972: found /usr/bin/pkg-config
- configure:16984: result: /usr/bin/pkg-config
- configure:17009: checking pkg-config is at least version 0.9.0
- configure:17012: result: yes
- configure:17124: checking for strndup
- configure:17124: /opt/ti-processor-sdk-linux-am335x-evm-04.02.00.09/linux-devkit/sysroots/x86_64-arago-linux/usr/bin/arm-linux-gnueabihf-gcc -o conftest conftest.c >&5
- conftest.c:56:6: warning: conflicting types for built-in function 'strndup'
- char strndup ();
- ^~~~~~~
- configure:17124: $? = 0
- configure:17124: result: yes
- configure:17133: checking for reallocarray
- configure:17133: /opt/ti-processor-sdk-linux-am335x-evm-04.02.00.09/linux-devkit/sysroots/x86_64-arago-linux/usr/bin/arm-linux-gnueabihf-gcc -o conftest conftest.c >&5
- /tmp/ccoWhO1s.o: In function `main':
- conftest.c:(.text+0x4): undefined reference to `reallocarray'
- collect2: error: ld returned 1 exit status
- configure:17133: $? = 1
- configure: failed program was:
- | /* confdefs.h */
- | #define PACKAGE_NAME "tpm2-tss"
- | #define PACKAGE_TARNAME "tpm2-tss"
- | #define PACKAGE_VERSION "3.2.0"
- | #define PACKAGE_STRING "tpm2-tss 3.2.0"
- | #define PACKAGE_BUGREPORT "https://github.com/tpm2-software/tpm2-tss/issues"
- | #define PACKAGE_URL "https://github.com/tpm2-software/tpm2-tss"
- | #define PACKAGE "tpm2-tss"
- | #define VERSION "3.2.0"
- | #define NDEBUG 1
- | #define STDC_HEADERS 1
- | #define HAVE_SYS_TYPES_H 1
- | #define HAVE_SYS_STAT_H 1
- | #define HAVE_STDLIB_H 1
- | #define HAVE_STRING_H 1
- | #define HAVE_MEMORY_H 1
- | #define HAVE_STRINGS_H 1
- | #define HAVE_INTTYPES_H 1
- | #define HAVE_STDINT_H 1
- | #define HAVE_UNISTD_H 1
- | #define __EXTENSIONS__ 1
- | #define _ALL_SOURCE 1
- | #define _GNU_SOURCE 1
- | #define _POSIX_PTHREAD_SEMANTICS 1
- | #define _TANDEM_SOURCE 1
- | #define HAVE_DLFCN_H 1
- | #define LT_OBJDIR ".libs/"
- | #define HAVE_LIBDL 1
- | #define HAVE_DLERROR 1
- | #define HAVE_LIBDLLOADER 1
- | #define SYSCONFDIR "/opt/ti-processor-sdk-linux-am335x-evm-04.02.00.09/EVSE/GPL/tpm2-tss-3.2.0/release/etc"
- | /* end confdefs.h. */
- | /* Define reallocarray to an innocuous variant, in case <limits.h> declares reallocarray.
- | For example, HP-UX 11i <limits.h> declares gettimeofday. */
- | #define reallocarray innocuous_reallocarray
- |
- | /* System header to define __stub macros and hopefully few prototypes,
- | which can conflict with char reallocarray (); below.
- | Prefer <limits.h> to <assert.h> if __STDC__ is defined, since
- | <limits.h> exists even on freestanding compilers. */
- |
- | #ifdef __STDC__
- | # include <limits.h>
- | #else
- | # include <assert.h>
- | #endif
- |
- | #undef reallocarray
- |
- | /* Override any GCC internal prototype to avoid an error.
- | Use char because int might match the return type of a GCC
- | builtin and then its argument prototype would still apply. */
- | #ifdef __cplusplus
- | extern "C"
- | #endif
- | char reallocarray ();
- | /* The GNU C library defines this for functions which it implements
- | to always fail with ENOSYS. Some functions are actually named
- | something starting with __ and the normal name is an alias. */
- | #if defined __stub_reallocarray || defined __stub___reallocarray
- | choke me
- | #endif
- |
- | int
- | main ()
- | {
- | return reallocarray ();
- | ;
- | return 0;
- | }
- configure:17133: result: no
- configure:17209: checking for CRYPTO
- configure:17274: result: yes
- configure:17281: checking for EVP_sm3 in -lcrypto
- configure:17306: /opt/ti-processor-sdk-linux-am335x-evm-04.02.00.09/linux-devkit/sysroots/x86_64-arago-linux/usr/bin/arm-linux-gnueabihf-gcc -o conftest conftest.c -lcrypto >&5
- configure:17306: $? = 0
- configure:17315: result: yes
- configure:17361: checking for JSONC
- configure:17446: result: yes
- configure:17455: checking for CURL
- configure:17540: result: yes
- configure:17662: checking libtpms/tpm_library.h usability
- configure:17662: /opt/ti-processor-sdk-linux-am335x-evm-04.02.00.09/linux-devkit/sysroots/x86_64-arago-linux/usr/bin/arm-linux-gnueabihf-gcc -c conftest.c >&5
- conftest.c:70:33: fatal error: libtpms/tpm_library.h: No such file or directory
- #include <libtpms/tpm_library.h>
- ^
- compilation terminated.
- configure:17662: $? = 1
- configure: failed program was:
- | /* confdefs.h */
- | #define PACKAGE_NAME "tpm2-tss"
- | #define PACKAGE_TARNAME "tpm2-tss"
- | #define PACKAGE_VERSION "3.2.0"
- | #define PACKAGE_STRING "tpm2-tss 3.2.0"
- | #define PACKAGE_BUGREPORT "https://github.com/tpm2-software/tpm2-tss/issues"
- | #define PACKAGE_URL "https://github.com/tpm2-software/tpm2-tss"
- | #define PACKAGE "tpm2-tss"
- | #define VERSION "3.2.0"
- | #define NDEBUG 1
- | #define STDC_HEADERS 1
- | #define HAVE_SYS_TYPES_H 1
- | #define HAVE_SYS_STAT_H 1
- | #define HAVE_STDLIB_H 1
- | #define HAVE_STRING_H 1
- | #define HAVE_MEMORY_H 1
- | #define HAVE_STRINGS_H 1
- | #define HAVE_INTTYPES_H 1
- | #define HAVE_STDINT_H 1
- | #define HAVE_UNISTD_H 1
- | #define __EXTENSIONS__ 1
- | #define _ALL_SOURCE 1
- | #define _GNU_SOURCE 1
- | #define _POSIX_PTHREAD_SEMANTICS 1
- | #define _TANDEM_SOURCE 1
- | #define HAVE_DLFCN_H 1
- | #define LT_OBJDIR ".libs/"
- | #define HAVE_LIBDL 1
- | #define HAVE_DLERROR 1
- | #define HAVE_LIBDLLOADER 1
- | #define SYSCONFDIR "/opt/ti-processor-sdk-linux-am335x-evm-04.02.00.09/EVSE/GPL/tpm2-tss-3.2.0/release/etc"
- | #define OSSL 1
- | #define HAVE_EVP_SM3 1
- | #define TCTI_DEVICE 1
- | #define TCTI_MSSIM 1
- | /* end confdefs.h. */
- | #include <stdio.h>
- | #ifdef HAVE_SYS_TYPES_H
- | # include <sys/types.h>
- | #endif
- | #ifdef HAVE_SYS_STAT_H
- | # include <sys/stat.h>
- | #endif
- | #ifdef STDC_HEADERS
- | # include <stdlib.h>
- | # include <stddef.h>
- | #else
- | # ifdef HAVE_STDLIB_H
- | # include <stdlib.h>
- | # endif
- | #endif
- | #ifdef HAVE_STRING_H
- | # if !defined STDC_HEADERS && defined HAVE_MEMORY_H
- | # include <memory.h>
- | # endif
- | # include <string.h>
- | #endif
- | #ifdef HAVE_STRINGS_H
- | # include <strings.h>
- | #endif
- | #ifdef HAVE_INTTYPES_H
- | # include <inttypes.h>
- | #endif
- | #ifdef HAVE_STDINT_H
- | # include <stdint.h>
- | #endif
- | #ifdef HAVE_UNISTD_H
- | # include <unistd.h>
- | #endif
- | #include <libtpms/tpm_library.h>
- configure:17662: result: no
- configure:17662: checking libtpms/tpm_library.h presence
- configure:17662: /opt/ti-processor-sdk-linux-am335x-evm-04.02.00.09/linux-devkit/sysroots/x86_64-arago-linux/usr/bin/arm-linux-gnueabihf-gcc -E conftest.c
- conftest.c:37:33: fatal error: libtpms/tpm_library.h: No such file or directory
- #include <libtpms/tpm_library.h>
- ^
- compilation terminated.
- configure:17662: $? = 1
- configure: failed program was:
- | /* confdefs.h */
- | #define PACKAGE_NAME "tpm2-tss"
- | #define PACKAGE_TARNAME "tpm2-tss"
- | #define PACKAGE_VERSION "3.2.0"
- | #define PACKAGE_STRING "tpm2-tss 3.2.0"
- | #define PACKAGE_BUGREPORT "https://github.com/tpm2-software/tpm2-tss/issues"
- | #define PACKAGE_URL "https://github.com/tpm2-software/tpm2-tss"
- | #define PACKAGE "tpm2-tss"
- | #define VERSION "3.2.0"
- | #define NDEBUG 1
- | #define STDC_HEADERS 1
- | #define HAVE_SYS_TYPES_H 1
- | #define HAVE_SYS_STAT_H 1
- | #define HAVE_STDLIB_H 1
- | #define HAVE_STRING_H 1
- | #define HAVE_MEMORY_H 1
- | #define HAVE_STRINGS_H 1
- | #define HAVE_INTTYPES_H 1
- | #define HAVE_STDINT_H 1
- | #define HAVE_UNISTD_H 1
- | #define __EXTENSIONS__ 1
- | #define _ALL_SOURCE 1
- | #define _GNU_SOURCE 1
- | #define _POSIX_PTHREAD_SEMANTICS 1
- | #define _TANDEM_SOURCE 1
- | #define HAVE_DLFCN_H 1
- | #define LT_OBJDIR ".libs/"
- | #define HAVE_LIBDL 1
- | #define HAVE_DLERROR 1
- | #define HAVE_LIBDLLOADER 1
- | #define SYSCONFDIR "/opt/ti-processor-sdk-linux-am335x-evm-04.02.00.09/EVSE/GPL/tpm2-tss-3.2.0/release/etc"
- | #define OSSL 1
- | #define HAVE_EVP_SM3 1
- | #define TCTI_DEVICE 1
- | #define TCTI_MSSIM 1
- | /* end confdefs.h. */
- | #include <libtpms/tpm_library.h>
- configure:17662: result: no
- configure:17662: checking for libtpms/tpm_library.h
- configure:17662: result: no
- configure:17667: WARNING: library libtpms missing
- configure:19019: checking for valgrind
- configure:19049: result: no
- configure:19415: checking if LD -Wl,--version-script works
- configure:19435: /opt/ti-processor-sdk-linux-am335x-evm-04.02.00.09/linux-devkit/sysroots/x86_64-arago-linux/usr/bin/arm-linux-gnueabihf-gcc -o conftest -Wl,--version-script=conftest.map conftest.c >&5
- /opt/ti-processor-sdk-linux-am335x-evm-04.02.00.09/linux-devkit/sysroots/x86_64-arago-linux/usr/bin/../lib/gcc/arm-linux-gnueabihf/6.2.1/../../../../arm-linux-gnueabihf/bin/ld:conftest.map:2: syntax error in VERSION script
- collect2: error: ld returned 1 exit status
- configure:19435: $? = 1
- configure: failed program was:
- | /* confdefs.h */
- | #define PACKAGE_NAME "tpm2-tss"
- | #define PACKAGE_TARNAME "tpm2-tss"
- | #define PACKAGE_VERSION "3.2.0"
- | #define PACKAGE_STRING "tpm2-tss 3.2.0"
- | #define PACKAGE_BUGREPORT "https://github.com/tpm2-software/tpm2-tss/issues"
- | #define PACKAGE_URL "https://github.com/tpm2-software/tpm2-tss"
- | #define PACKAGE "tpm2-tss"
- | #define VERSION "3.2.0"
- | #define NDEBUG 1
- | #define STDC_HEADERS 1
- | #define HAVE_SYS_TYPES_H 1
- | #define HAVE_SYS_STAT_H 1
- | #define HAVE_STDLIB_H 1
- | #define HAVE_STRING_H 1
- | #define HAVE_MEMORY_H 1
- | #define HAVE_STRINGS_H 1
- | #define HAVE_INTTYPES_H 1
- | #define HAVE_STDINT_H 1
- | #define HAVE_UNISTD_H 1
- | #define __EXTENSIONS__ 1
- | #define _ALL_SOURCE 1
- | #define _GNU_SOURCE 1
- | #define _POSIX_PTHREAD_SEMANTICS 1
- | #define _TANDEM_SOURCE 1
- | #define HAVE_DLFCN_H 1
- | #define LT_OBJDIR ".libs/"
- | #define HAVE_LIBDL 1
- | #define HAVE_DLERROR 1
- | #define HAVE_LIBDLLOADER 1
- | #define SYSCONFDIR "/opt/ti-processor-sdk-linux-am335x-evm-04.02.00.09/EVSE/GPL/tpm2-tss-3.2.0/release/etc"
- | #define OSSL 1
- | #define HAVE_EVP_SM3 1
- | #define TCTI_DEVICE 1
- | #define TCTI_MSSIM 1
- | #define TCTI_CMD 1
- | /* end confdefs.h. */
- |
- | int
- | main ()
- | {
- |
- | ;
- | return 0;
- | }
- configure:19458: /opt/ti-processor-sdk-linux-am335x-evm-04.02.00.09/linux-devkit/sysroots/x86_64-arago-linux/usr/bin/arm-linux-gnueabihf-gcc -o conftest -Wl,--version-script=conftest.map conftest.c >&5
- configure:19458: $? = 0
- configure:19469: result: yes
- configure:19557: checking whether C compiler accepts -O2
- configure:19578: /opt/ti-processor-sdk-linux-am335x-evm-04.02.00.09/linux-devkit/sysroots/x86_64-arago-linux/usr/bin/arm-linux-gnueabihf-gcc -c
- -Wall -Werror
- -O2 conftest.c >&5
- configure:19578: $? = 0
- configure:19586: result: yes
- configure:19607: checking whether to add -D_FORTIFY_SOURCE=2 to CPPFLAGS
- configure:19623: /opt/ti-processor-sdk-linux-am335x-evm-04.02.00.09/linux-devkit/sysroots/x86_64-arago-linux/usr/bin/arm-linux-gnueabihf-gcc -o conftest conftest.c >&5
- configure:19623: $? = 0
- configure:19625: result: yes
- configure:19640: checking whether C compiler accepts -std=c99
- configure:19661: /opt/ti-processor-sdk-linux-am335x-evm-04.02.00.09/linux-devkit/sysroots/x86_64-arago-linux/usr/bin/arm-linux-gnueabihf-gcc -c
- -Wall -Werror
- -std=c99 -D_FORTIFY_SOURCE=2 conftest.c >&5
- configure:19661: $? = 0
- configure:19669: result: yes
- configure:19690: checking whether C compiler accepts -Wall
- configure:19711: /opt/ti-processor-sdk-linux-am335x-evm-04.02.00.09/linux-devkit/sysroots/x86_64-arago-linux/usr/bin/arm-linux-gnueabihf-gcc -c
- -Wall -Werror
- -Wall -D_FORTIFY_SOURCE=2 conftest.c >&5
- configure:19711: $? = 0
- configure:19719: result: yes
- configure:19740: checking whether C compiler accepts -Wextra
- configure:19761: /opt/ti-processor-sdk-linux-am335x-evm-04.02.00.09/linux-devkit/sysroots/x86_64-arago-linux/usr/bin/arm-linux-gnueabihf-gcc -c
- -Wall -Werror
- -Wextra -D_FORTIFY_SOURCE=2 conftest.c >&5
- configure:19761: $? = 0
- configure:19769: result: yes
- configure:19790: checking whether C compiler accepts -Wformat-security
- configure:19811: /opt/ti-processor-sdk-linux-am335x-evm-04.02.00.09/linux-devkit/sysroots/x86_64-arago-linux/usr/bin/arm-linux-gnueabihf-gcc -c
- -Wall -Werror
- -Wformat-security -D_FORTIFY_SOURCE=2 conftest.c >&5
- configure:19811: $? = 0
- configure:19819: result: yes
- configure:19892: checking whether C compiler accepts -fstack-protector-all
- configure:19913: /opt/ti-processor-sdk-linux-am335x-evm-04.02.00.09/linux-devkit/sysroots/x86_64-arago-linux/usr/bin/arm-linux-gnueabihf-gcc -c
- -Wall -Werror
- -fstack-protector-all -D_FORTIFY_SOURCE=2 conftest.c >&5
- configure:19913: $? = 0
- configure:19921: result: yes
- configure:19942: checking whether C compiler accepts -fpic
- configure:19963: /opt/ti-processor-sdk-linux-am335x-evm-04.02.00.09/linux-devkit/sysroots/x86_64-arago-linux/usr/bin/arm-linux-gnueabihf-gcc -c
- -Wall -Werror
- -fpic -D_FORTIFY_SOURCE=2 conftest.c >&5
- configure:19963: $? = 0
- configure:19971: result: yes
- configure:19992: checking whether C compiler accepts -fPIC
- configure:20013: /opt/ti-processor-sdk-linux-am335x-evm-04.02.00.09/linux-devkit/sysroots/x86_64-arago-linux/usr/bin/arm-linux-gnueabihf-gcc -c
- -Wall -Werror
- -fPIC -D_FORTIFY_SOURCE=2 conftest.c >&5
- configure:20013: $? = 0
- configure:20021: result: yes
- configure:20044: checking whether C compiler accepts -Wno-missing-braces
- configure:20065: /opt/ti-processor-sdk-linux-am335x-evm-04.02.00.09/linux-devkit/sysroots/x86_64-arago-linux/usr/bin/arm-linux-gnueabihf-gcc -c
- -Wall -Werror
- -Wno-missing-braces -D_FORTIFY_SOURCE=2 conftest.c >&5
- configure:20065: $? = 0
- configure:20073: result: yes
- configure:20094: checking whether C compiler accepts -Wstrict-overflow=5
- configure:20115: /opt/ti-processor-sdk-linux-am335x-evm-04.02.00.09/linux-devkit/sysroots/x86_64-arago-linux/usr/bin/arm-linux-gnueabihf-gcc -c
- -Wall -Werror
- -Wstrict-overflow=5 -D_FORTIFY_SOURCE=2 conftest.c >&5
- configure:20115: $? = 0
- configure:20123: result: yes
- configure:20144: checking whether the linker accepts -Wl,--no-undefined
- configure:20163: /opt/ti-processor-sdk-linux-am335x-evm-04.02.00.09/linux-devkit/sysroots/x86_64-arago-linux/usr/bin/arm-linux-gnueabihf-gcc -o conftest -D_FORTIFY_SOURCE=2 -Wl,--no-undefined conftest.c >&5
- configure:20163: $? = 0
- configure:20172: result: yes
- configure:20194: checking whether the linker accepts -Wl,-z,noexecstack
- configure:20213: /opt/ti-processor-sdk-linux-am335x-evm-04.02.00.09/linux-devkit/sysroots/x86_64-arago-linux/usr/bin/arm-linux-gnueabihf-gcc -o conftest -D_FORTIFY_SOURCE=2 -Wl,-z,noexecstack conftest.c >&5
- configure:20213: $? = 0
- configure:20222: result: yes
- configure:20244: checking whether the linker accepts -Wl,-z,now
- configure:20263: /opt/ti-processor-sdk-linux-am335x-evm-04.02.00.09/linux-devkit/sysroots/x86_64-arago-linux/usr/bin/arm-linux-gnueabihf-gcc -o conftest -D_FORTIFY_SOURCE=2 -Wl,-z,now conftest.c >&5
- configure:20263: $? = 0
- configure:20272: result: yes
- configure:20294: checking whether the linker accepts -Wl,-z,relro
- configure:20313: /opt/ti-processor-sdk-linux-am335x-evm-04.02.00.09/linux-devkit/sysroots/x86_64-arago-linux/usr/bin/arm-linux-gnueabihf-gcc -o conftest -D_FORTIFY_SOURCE=2 -Wl,-z,relro conftest.c >&5
- configure:20313: $? = 0
- configure:20322: result: yes
- configure:20386: checking for systemd-sysusers
- configure:20402: found /bin/systemd-sysusers
- configure:20413: result: yes
- configure:20431: checking for systemd-tmpfiles
- configure:20447: found /bin/systemd-tmpfiles
- configure:20458: result: yes
- configure:20479: checking for useradd
- configure:20495: found /sbin/useradd
- configure:20506: result: yes
- configure:20516: checking for groupadd
- configure:20532: found /sbin/groupadd
- configure:20543: result: yes
- configure:20553: checking for adduser
- configure:20569: found /bin/adduser
- configure:20580: result: yes
- configure:20590: checking for addgroup
- configure:20606: found /bin/addgroup
- configure:20617: result: yes
- configure:22689: checking whether to build with code coverage support
- configure:22709: result: no
- configure:23172: checking that generated files are newer than configure
- configure:23178: result: done
- configure:23317: creating ./config.status
- ## ---------------------- ##
- ## Running config.status. ##
- ## ---------------------- ##
- This file was extended by tpm2-tss config.status 3.2.0, which was
- generated by GNU Autoconf 2.69. Invocation command line was
- CONFIG_FILES =
- CONFIG_HEADERS =
- CONFIG_LINKS =
- CONFIG_COMMANDS =
- $ ./config.status
- on csu4-platform
- config.status:1455: creating Makefile
- config.status:1455: creating Doxyfile
- config.status:1455: creating lib/tss2-sys.pc
- config.status:1455: creating lib/tss2-esys.pc
- config.status:1455: creating lib/tss2-mu.pc
- config.status:1455: creating lib/tss2-tcti-device.pc
- config.status:1455: creating lib/tss2-tcti-mssim.pc
- config.status:1455: creating lib/tss2-tcti-swtpm.pc
- config.status:1455: creating lib/tss2-tcti-libtpms.pc
- config.status:1455: creating lib/tss2-tcti-pcap.pc
- config.status:1455: creating lib/tss2-rc.pc
- config.status:1455: creating lib/tss2-tctildr.pc
- config.status:1455: creating lib/tss2-fapi.pc
- config.status:1455: creating lib/tss2-tcti-cmd.pc
- config.status:1455: creating config.h
- config.status:1684: executing depfiles commands
- config.status:1761: cd . && sed -e '/# am--include-marker/d' Makefile | make -f - am--depfiles
- make[1]: Entering directory '/opt/ti-processor-sdk-linux-am335x-evm-04.02.00.09/EVSE/GPL/tpm2-tss-3.2.0'
- make[1]: Nothing to be done for 'am--depfiles'.
- make[1]: Leaving directory '/opt/ti-processor-sdk-linux-am335x-evm-04.02.00.09/EVSE/GPL/tpm2-tss-3.2.0'
- config.status:1766: $? = 0
- config.status:1684: executing libtool commands
- configure:25760: result:
- tpm2-tss 3.2.0
- esys: yes
- fapi: yes
- tctidefaultmodule: libtss2-tcti-default.so
- tctidefaultconfig:
- unit: no
- integration: no
- testing backend:
- fuzzing: none
- debug: no
- maxloglevel: trace
- doxygen: 0 no
- crypto backend: ossl
- sysconfdir: ${prefix}/etc
- localstatedir: ${prefix}/var
- runstatedir: ${localstatedir}/run
- sysusersdir: ${prefix}/etc/sysusers.d
- tmpfilesdir: ${prefix}/etc/tmpfiles.d
- userstatedir: $HOME/.local/share
- ## ---------------- ##
- ## Cache variables. ##
- ## ---------------- ##
- ac_cv_build=x86_64-pc-linux-gnu
- ac_cv_c_compiler_gnu=yes
- ac_cv_cxx_compiler_gnu=yes
- ac_cv_env_CCC_set=
- ac_cv_env_CCC_value=
- ac_cv_env_CC_set=set
- ac_cv_env_CC_value=/opt/ti-processor-sdk-linux-am335x-evm-04.02.00.09/linux-devkit/sysroots/x86_64-arago-linux/usr/bin/arm-linux-gnueabihf-gcc
- ac_cv_env_CFLAGS_set=
- ac_cv_env_CFLAGS_value=
- ac_cv_env_CMOCKA_CFLAGS_set=
- ac_cv_env_CMOCKA_CFLAGS_value=
- ac_cv_env_CMOCKA_LIBS_set=
- ac_cv_env_CMOCKA_LIBS_value=
- ac_cv_env_CPPFLAGS_set=
- ac_cv_env_CPPFLAGS_value=
- ac_cv_env_CPP_set=
- ac_cv_env_CPP_value=
- ac_cv_env_CRYPTO_CFLAGS_set=set
- ac_cv_env_CRYPTO_CFLAGS_value=-I/opt/ti-processor-sdk-linux-am335x-evm-04.02.00.09/EVSE/GPL/openssl-1.1.1n/release/include
- ac_cv_env_CRYPTO_LIBS_set=set
- ac_cv_env_CRYPTO_LIBS_value='-L/opt/ti-processor-sdk-linux-am335x-evm-04.02.00.09/EVSE/GPL/openssl-1.1.1n/release/lib -lssl -lcrypto'
- ac_cv_env_CURL_CFLAGS_set=set
- ac_cv_env_CURL_CFLAGS_value=-I/opt/ti-processor-sdk-linux-am335x-evm-04.02.00.09/EVSE/GPL/curl-7.61.1/release/include
- ac_cv_env_CURL_LIBS_set=set
- ac_cv_env_CURL_LIBS_value='-L/opt/ti-processor-sdk-linux-am335x-evm-04.02.00.09/EVSE/GPL/curl-7.61.1/release/lib -lcurl'
- ac_cv_env_CXXCPP_set=
- ac_cv_env_CXXCPP_value=
- ac_cv_env_CXXFLAGS_set=
- ac_cv_env_CXXFLAGS_value=
- ac_cv_env_CXX_set=set
- ac_cv_env_CXX_value=/opt/ti-processor-sdk-linux-am335x-evm-04.02.00.09/linux-devkit/sysroots/x86_64-arago-linux/usr/bin/arm-linux-gnueabihf-g++
- ac_cv_env_DOXYGEN_PAPER_SIZE_set=
- ac_cv_env_DOXYGEN_PAPER_SIZE_value=
- ac_cv_env_JSONC_CFLAGS_set=set
- ac_cv_env_JSONC_CFLAGS_value=-I/opt/ti-processor-sdk-linux-am335x-evm-04.02.00.09/EVSE/GPL/json-c-json-c-0.13.1-20180305/release/include
- ac_cv_env_JSONC_LIBS_set=set
- ac_cv_env_JSONC_LIBS_value='-L/opt/ti-processor-sdk-linux-am335x-evm-04.02.00.09/EVSE/GPL/json-c-json-c-0.13.1-20180305/release/lib -ljson-c'
- ac_cv_env_LDFLAGS_set=
- ac_cv_env_LDFLAGS_value=
- ac_cv_env_LIBS_set=
- ac_cv_env_LIBS_value=
- ac_cv_env_LT_SYS_LIBRARY_PATH_set=
- ac_cv_env_LT_SYS_LIBRARY_PATH_value=
- ac_cv_env_PKG_CONFIG_LIBDIR_set=
- ac_cv_env_PKG_CONFIG_LIBDIR_value=
- ac_cv_env_PKG_CONFIG_PATH_set=
- ac_cv_env_PKG_CONFIG_PATH_value=
- ac_cv_env_PKG_CONFIG_set=
- ac_cv_env_PKG_CONFIG_value=
- ac_cv_env_build_alias_set=
- ac_cv_env_build_alias_value=
- ac_cv_env_host_alias_set=set
- ac_cv_env_host_alias_value=arm-linux-gnueabihf
- ac_cv_env_target_alias_set=
- ac_cv_env_target_alias_value=
- ac_cv_func_dlerror=yes
- ac_cv_func_reallocarray=no
- ac_cv_func_shl_load=no
- ac_cv_func_strndup=yes
- ac_cv_header_dlfcn_h=yes
- ac_cv_header_inttypes_h=yes
- ac_cv_header_libtpms_tpm_library_h=no
- ac_cv_header_memory_h=yes
- ac_cv_header_minix_config_h=no
- ac_cv_header_stdc=yes
- ac_cv_header_stdint_h=yes
- ac_cv_header_stdlib_h=yes
- ac_cv_header_string_h=yes
- ac_cv_header_strings_h=yes
- ac_cv_header_sys_stat_h=yes
- ac_cv_header_sys_types_h=yes
- ac_cv_header_unistd_h=yes
- ac_cv_host=arm-unknown-linux-gnueabihf
- ac_cv_lib_crypto_EVP_sm3=yes
- ac_cv_lib_dld_dld_link=no
- ac_cv_lib_dld_shl_load=no
- ac_cv_objext=o
- ac_cv_path_EGREP='/bin/grep -E'
- ac_cv_path_FGREP='/bin/grep -F'
- ac_cv_path_GREP=/bin/grep
- ac_cv_path_SED=/bin/sed
- ac_cv_path_ac_pt_PKG_CONFIG=/usr/bin/pkg-config
- ac_cv_path_install='/usr/bin/install -c'
- ac_cv_path_lt_DD=/bin/dd
- ac_cv_path_mkdir=/bin/mkdir
- ac_cv_prog_AR=/opt/ti-processor-sdk-linux-am335x-evm-04.02.00.09/linux-devkit/sysroots/x86_64-arago-linux/usr/bin/arm-linux-gnueabihf-ar
- ac_cv_prog_AWK=gawk
- ac_cv_prog_CC=/opt/ti-processor-sdk-linux-am335x-evm-04.02.00.09/linux-devkit/sysroots/x86_64-arago-linux/usr/bin/arm-linux-gnueabihf-gcc
- ac_cv_prog_CPP='/opt/ti-processor-sdk-linux-am335x-evm-04.02.00.09/linux-devkit/sysroots/x86_64-arago-linux/usr/bin/arm-linux-gnueabihf-gcc -E'
- ac_cv_prog_CXXCPP='/opt/ti-processor-sdk-linux-am335x-evm-04.02.00.09/linux-devkit/sysroots/x86_64-arago-linux/usr/bin/arm-linux-gnueabihf-g++ -E'
- ac_cv_prog_RANLIB=/opt/ti-processor-sdk-linux-am335x-evm-04.02.00.09/linux-devkit/sysroots/x86_64-arago-linux/usr/bin/arm-linux-gnueabihf-ranlib
- ac_cv_prog_STRIP=/opt/ti-processor-sdk-linux-am335x-evm-04.02.00.09/linux-devkit/sysroots/x86_64-arago-linux/usr/bin/arm-linux-gnueabihf-strip
- ac_cv_prog_ac_ct_DUMPBIN='link -dump'
- ac_cv_prog_ac_ct_MANIFEST_TOOL=mt
- ac_cv_prog_ac_ct_OBJDUMP=objdump
- ac_cv_prog_addgroup=yes
- ac_cv_prog_adduser=yes
- ac_cv_prog_cc_c89=
- ac_cv_prog_cc_g=yes
- ac_cv_prog_cxx_g=yes
- ac_cv_prog_groupadd=yes
- ac_cv_prog_make_make_set=yes
- ac_cv_prog_systemd_sysusers=yes
- ac_cv_prog_systemd_tmpfiles=yes
- ac_cv_prog_useradd=yes
- ac_cv_safe_to_define___extensions__=yes
- ac_cv_search_dlopen=-ldl
- am_cv_CC_dependencies_compiler_type=gcc3
- am_cv_CXX_dependencies_compiler_type=gcc3
- am_cv_make_support_nested_variables=yes
- am_cv_prog_cc_c_o=yes
- ax_cv_check_cflags___________Wall__Werror_______O2=yes
- ax_cv_check_cflags___________Wall__Werror_______Wall=yes
- ax_cv_check_cflags___________Wall__Werror_______Wextra=yes
- ax_cv_check_cflags___________Wall__Werror_______Wformat_security=yes
- ax_cv_check_cflags___________Wall__Werror_______Wno_missing_braces=yes
- ax_cv_check_cflags___________Wall__Werror_______Wstrict_overflow_5=yes
- ax_cv_check_cflags___________Wall__Werror_______fPIC=yes
- ax_cv_check_cflags___________Wall__Werror_______fpic=yes
- ax_cv_check_cflags___________Wall__Werror_______fstack_protector_all=yes
- ax_cv_check_cflags___________Wall__Werror_______std_c99=yes
- ax_cv_check_ldflags___Wl___no_undefined=yes
- ax_cv_check_ldflags___Wl__z_noexecstack=yes
- ax_cv_check_ldflags___Wl__z_now=yes
- ax_cv_check_ldflags___Wl__z_relro=yes
- gl_cv_sys_ld_version_script=yes
- libltdl_cv_lib_dl_dlopen=yes
- lt_cv_ar_at_file=@
- lt_cv_archive_cmds_need_lc=no
- lt_cv_deplibs_check_method=pass_all
- lt_cv_file_magic_cmd='$MAGIC_CMD'
- lt_cv_file_magic_test_file=
- lt_cv_ld_reload_flag=-r
- lt_cv_nm_interface='BSD nm'
- lt_cv_objdir=.libs
- lt_cv_path_LD=/opt/ti-processor-sdk-linux-am335x-evm-04.02.00.09/linux-devkit/sysroots/x86_64-arago-linux/usr/bin/arm-linux-gnueabihf-ld
- lt_cv_path_LDCXX=/opt/ti-processor-sdk-linux-am335x-evm-04.02.00.09/linux-devkit/sysroots/x86_64-arago-linux/usr/bin/arm-linux-gnueabihf-ld
- lt_cv_path_NM=no
- lt_cv_path_mainfest_tool=no
- lt_cv_prog_compiler_c_o=yes
- lt_cv_prog_compiler_c_o_CXX=yes
- lt_cv_prog_compiler_pic='-fPIC -DPIC'
- lt_cv_prog_compiler_pic_CXX='-fPIC -DPIC'
- lt_cv_prog_compiler_pic_works=yes
- lt_cv_prog_compiler_pic_works_CXX=yes
- lt_cv_prog_compiler_rtti_exceptions=no
- lt_cv_prog_compiler_static_works=yes
- lt_cv_prog_compiler_static_works_CXX=yes
- lt_cv_prog_gnu_ld=yes
- lt_cv_prog_gnu_ldcxx=yes
- lt_cv_sharedlib_from_linklib_cmd='printf %s\n'
- lt_cv_shlibpath_overrides_runpath=no
- lt_cv_sys_global_symbol_pipe='sed -n -e '\''s/^.*[ ]\([ABCDGIRSTW][ABCDGIRSTW]*\)[ ][ ]*\([_A-Za-z][_A-Za-z0-9]*\)$/\1 \2 \2/p'\'' | sed '\''/ __gnu_lto/d'\'''
- lt_cv_sys_global_symbol_to_c_name_address='sed -n -e '\''s/^: \(.*\) .*$/ {"\1", (void *) 0},/p'\'' -e '\''s/^[ABCDGIRSTW][ABCDGIRSTW]* .* \(.*\)$/ {"\1", (void *) \&\1},/p'\'''
- lt_cv_sys_global_symbol_to_c_name_address_lib_prefix='sed -n -e '\''s/^: \(.*\) .*$/ {"\1", (void *) 0},/p'\'' -e '\''s/^[ABCDGIRSTW][ABCDGIRSTW]* .* \(lib.*\)$/ {"\1", (void *) \&\1},/p'\'' -e '\''s/^[ABCDGIRSTW][ABCDGIRSTW]* .* \(.*\)$/ {"lib\1", (void *) \&\1},/p'\'''
- lt_cv_sys_global_symbol_to_cdecl='sed -n -e '\''s/^T .* \(.*\)$/extern int \1();/p'\'' -e '\''s/^[ABCDGIRSTW][ABCDGIRSTW]* .* \(.*\)$/extern char \1;/p'\'''
- lt_cv_sys_global_symbol_to_import=
- lt_cv_sys_max_cmd_len=1572864
- lt_cv_to_host_file_cmd=func_convert_file_noop
- lt_cv_to_tool_file_cmd=func_convert_file_noop
- lt_cv_truncate_bin='/bin/dd bs=4096 count=1'
- pkg_cv_CRYPTO_CFLAGS=-I/opt/ti-processor-sdk-linux-am335x-evm-04.02.00.09/EVSE/GPL/openssl-1.1.1n/release/include
- pkg_cv_CRYPTO_LIBS='-L/opt/ti-processor-sdk-linux-am335x-evm-04.02.00.09/EVSE/GPL/openssl-1.1.1n/release/lib -lssl -lcrypto'
- pkg_cv_CURL_CFLAGS=-I/opt/ti-processor-sdk-linux-am335x-evm-04.02.00.09/EVSE/GPL/curl-7.61.1/release/include
- pkg_cv_CURL_LIBS='-L/opt/ti-processor-sdk-linux-am335x-evm-04.02.00.09/EVSE/GPL/curl-7.61.1/release/lib -lcurl'
- pkg_cv_JSONC_CFLAGS=-I/opt/ti-processor-sdk-linux-am335x-evm-04.02.00.09/EVSE/GPL/json-c-json-c-0.13.1-20180305/release/include
- pkg_cv_JSONC_LIBS='-L/opt/ti-processor-sdk-linux-am335x-evm-04.02.00.09/EVSE/GPL/json-c-json-c-0.13.1-20180305/release/lib -ljson-c'
- ## ----------------- ##
- ## Output variables. ##
- ## ----------------- ##
- $(foreach tool, $(valgrind_enabled_tools), check-valgrind-$(tool))
- LOG_COMPILER="$$(VALGRIND_LOG_COMPILER)" \
- LOG_FLAGS="$$(valgrind_$(1)_flags)" \
- TESTS_ENVIRONMENT="$$(VALGRIND_TESTS_ENVIRONMENT)" \
- TEST_SUITE_LOG=test-suite-$(1).log
- $$(valgrind_v_use)$$(MAKE) check-TESTS \
- $(AM_V_at)$(MAKE) $(AM_MAKEFLAGS) -k \
- $(TESTS_ENVIRONMENT) \
- $(VALGRIND) $(VALGRIND_SUPPRESSIONS) --error-exitcode=1 $(VALGRIND_FLAGS)
- $(valgrind_lt) \
- @echo "Need to reconfigure with --enable-valgrind"
- @echo "Need to reconfigure with --enable-valgrind"
- @echo "Need to reconfigure with --enable-valgrind-$(1)"
- G_DEBUG=fatal-warnings,fatal-criticals,gc-friendly
- G_SLICE=always-malloc,debug-blocks \
- env VALGRIND=$(VALGRIND) \
- #
- # (Default: --num-callers=30)
- # files to load. (Default: empty)
- # memcheck, helgrind, drd, sgcheck). (Default: various)
- # - VALGRIND_$toolname_FLAGS: Flags to pass to Valgrind $toolname (one of:
- # - VALGRIND_FLAGS: General flags to pass to all Valgrind tools.
- # - VALGRIND_SUPPRESSIONS_FILES: Space-separated list of Valgrind suppressions
- # Internal use
- # Optional variables
- # Optional:
- # Support running with and without libtool.
- # Use recursive makes in order to ignore errors during check
- # Valgrind check
- # Valgrind running
- $(foreach tool,$(valgrind_tools),$(eval $(call valgrind_tool_rule,$(tool))))
- '
- .PHONY: check-valgrind $(add-prefix check-valgrind-,$(valgrind_tools))
- ACLOCAL='${SHELL} /opt/ti-processor-sdk-linux-am335x-evm-04.02.00.09/EVSE/GPL/tpm2-tss-3.2.0/missing aclocal-1.16'
- AMDEPBACKSLASH='\'
- AMDEP_FALSE='#'
- AMDEP_TRUE=''
- AMTAR='$${TAR-tar}'
- AM_BACKSLASH='\'
- AM_DEFAULT_V='$(AM_DEFAULT_VERBOSITY)'
- AM_DEFAULT_VERBOSITY='0'
- AM_DISTCHECK_CONFIGURE_FLAGS += --disable-valgrind
- AM_DISTCHECK_CONFIGURE_FLAGS ?=
- AM_V='$(V)'
- AR='/opt/ti-processor-sdk-linux-am335x-evm-04.02.00.09/linux-devkit/sysroots/x86_64-arago-linux/usr/bin/arm-linux-gnueabihf-ar'
- AUTOCONF='${SHELL} /opt/ti-processor-sdk-linux-am335x-evm-04.02.00.09/EVSE/GPL/tpm2-tss-3.2.0/missing autoconf'
- AUTOCONF_CODE_COVERAGE_2019_01_06_FALSE='#'
- AUTOCONF_CODE_COVERAGE_2019_01_06_TRUE=''
- AUTOHEADER='${SHELL} /opt/ti-processor-sdk-linux-am335x-evm-04.02.00.09/EVSE/GPL/tpm2-tss-3.2.0/missing autoheader'
- AUTOMAKE='${SHELL} /opt/ti-processor-sdk-linux-am335x-evm-04.02.00.09/EVSE/GPL/tpm2-tss-3.2.0/missing automake-1.16'
- AWK='gawk'
- CC='/opt/ti-processor-sdk-linux-am335x-evm-04.02.00.09/linux-devkit/sysroots/x86_64-arago-linux/usr/bin/arm-linux-gnueabihf-gcc'
- CCDEPMODE='depmode=gcc3'
- CFLAGS=''
- CMOCKA_CFLAGS=''
- CMOCKA_LIBS=''
- CODE_COVERAGE_CFLAGS=''
- CODE_COVERAGE_CPPFLAGS=''
- CODE_COVERAGE_CXXFLAGS=''
- CODE_COVERAGE_ENABLED='no'
- CODE_COVERAGE_ENABLED_FALSE=''
- CODE_COVERAGE_ENABLED_TRUE='#'
- CODE_COVERAGE_LIBS=''
- CPP='/opt/ti-processor-sdk-linux-am335x-evm-04.02.00.09/linux-devkit/sysroots/x86_64-arago-linux/usr/bin/arm-linux-gnueabihf-gcc -E'
- CPPFLAGS=' -D_FORTIFY_SOURCE=2'
- CRYPTO_CFLAGS='-I/opt/ti-processor-sdk-linux-am335x-evm-04.02.00.09/EVSE/GPL/openssl-1.1.1n/release/include'
- CRYPTO_LIBS='-L/opt/ti-processor-sdk-linux-am335x-evm-04.02.00.09/EVSE/GPL/openssl-1.1.1n/release/lib -lssl -lcrypto'
- CURL_CFLAGS='-I/opt/ti-processor-sdk-linux-am335x-evm-04.02.00.09/EVSE/GPL/curl-7.61.1/release/include'
- CURL_LIBS='-L/opt/ti-processor-sdk-linux-am335x-evm-04.02.00.09/EVSE/GPL/curl-7.61.1/release/lib -lcurl'
- CXX='/opt/ti-processor-sdk-linux-am335x-evm-04.02.00.09/linux-devkit/sysroots/x86_64-arago-linux/usr/bin/arm-linux-gnueabihf-g++'
- CXXCPP='/opt/ti-processor-sdk-linux-am335x-evm-04.02.00.09/linux-devkit/sysroots/x86_64-arago-linux/usr/bin/arm-linux-gnueabihf-g++ -E'
- CXXDEPMODE='depmode=gcc3'
- CXXFLAGS=''
- CYGPATH_W='echo'
- DEFS='-DHAVE_CONFIG_H'
- DEPDIR='.deps'
- DEVICEDESTRUCTIVE_FALSE=''
- DEVICEDESTRUCTIVE_TRUE='#'
- DEVICEMANDATORY_FALSE='#'
- DEVICEMANDATORY_TRUE=''
- DEVICEOPTIONAL_FALSE=''
- DEVICEOPTIONAL_TRUE='#'
- DISTCHECK_CONFIGURE_FLAGS=' '\''--host=arm-linux-gnueabihf'\'' '\''--prefix=/opt/ti-processor-sdk-linux-am335x-evm-04.02.00.09/EVSE/GPL/tpm2-tss-3.2.0/release'\'' '\''CC=/opt/ti-processor-sdk-linux-am335x-evm-04.02.00.09/linux-devkit/sysroots/x86_64-arago-linux/usr/bin/arm-linux-gnueabihf-gcc'\'' '\''AR=/opt/ti-processor-sdk-linux-am335x-evm-04.02.00.09/linux-devkit/sysroots/x86_64-arago-linux/usr/bin/arm-linux-gnueabihf-ar'\'' '\''RANLIB=/opt/ti-processor-sdk-linux-am335x-evm-04.02.00.09/linux-devkit/sysroots/x86_64-arago-linux/usr/bin/arm-linux-gnueabihf-ranlib'\'' '\''STRIP=/opt/ti-processor-sdk-linux-am335x-evm-04.02.00.09/linux-devkit/sysroots/x86_64-arago-linux/usr/bin/arm-linux-gnueabihf-strip'\'' '\''CXX=/opt/ti-processor-sdk-linux-am335x-evm-04.02.00.09/linux-devkit/sysroots/x86_64-arago-linux/usr/bin/arm-linux-gnueabihf-g++'\'' '\''LD=/opt/ti-processor-sdk-linux-am335x-evm-04.02.00.09/linux-devkit/sysroots/x86_64-arago-linux/usr/bin/arm-linux-gnueabihf-ld'\'' '\''CRYPTO_CFLAGS=-I/opt/ti-processor-sdk-linux-am335x-evm-04.02.00.09/EVSE/GPL/openssl-1.1.1n/release/include'\'' '\''CRYPTO_LIBS=-L/opt/ti-processor-sdk-linux-am335x-evm-04.02.00.09/EVSE/GPL/openssl-1.1.1n/release/lib -lssl -lcrypto'\'' '\''JSONC_CFLAGS=-I/opt/ti-processor-sdk-linux-am335x-evm-04.02.00.09/EVSE/GPL/json-c-json-c-0.13.1-20180305/release/include'\'' '\''JSONC_LIBS=-L/opt/ti-processor-sdk-linux-am335x-evm-04.02.00.09/EVSE/GPL/json-c-json-c-0.13.1-20180305/release/lib -ljson-c'\'' '\''CURL_CFLAGS=-I/opt/ti-processor-sdk-linux-am335x-evm-04.02.00.09/EVSE/GPL/curl-7.61.1/release/include'\'' '\''CURL_LIBS=-L/opt/ti-processor-sdk-linux-am335x-evm-04.02.00.09/EVSE/GPL/curl-7.61.1/release/lib -lcurl'\'' '\''--disable-doxygen-doc'\'' '\''--disable-doxygen-man'\'' '\''--disable-doxygen-rtf'\'' '\''--disable-doxygen-html'\'' '\''--disable-tcti-swtpm'\'' '\''host_alias=arm-linux-gnueabihf'\'''
- DLLTOOL='false'
- DOT_PATH=''
- DOXYGEN_PAPER_SIZE=''
- DOXYMAN_FALSE=''
- DOXYMAN_TRUE='#'
- DSYMUTIL=''
- DUMPBIN=':'
- DX_CONFIG='Doxyfile'
- DX_DOCDIR='doxygen-doc'
- DX_DOT=''
- DX_DOXYGEN=''
- DX_DVIPS=''
- DX_EGREP=''
- DX_ENV=' SRCDIR='\''.'\'' PROJECT='\''tpm2-tss'\'' VERSION='\''3.2.0'\'' HAVE_DOT='\''NO'\'' GENERATE_MAN='\''NO'\'' GENERATE_RTF='\''NO'\'' GENERATE_XML='\''NO'\'' GENERATE_HTMLHELP='\''NO'\'' GENERATE_CHI='\''NO'\'' GENERATE_HTML='\''NO'\'' GENERATE_LATEX='\''NO'\'''
- DX_FLAG_chi='0'
- DX_FLAG_chm='0'
- DX_FLAG_doc='0'
- DX_FLAG_dot='0'
- DX_FLAG_html='0'
- DX_FLAG_man='0'
- DX_FLAG_pdf='0'
- DX_FLAG_ps='0'
- DX_FLAG_rtf='0'
- DX_FLAG_xml='0'
- DX_HHC=''
- DX_LATEX=''
- DX_MAKEINDEX=''
- DX_PDFLATEX=''
- DX_PERL=''
- DX_PROJECT='tpm2-tss'
- DX_RULES=''
- ECHO_C=''
- ECHO_N='-n'
- ECHO_T=''
- EGREP='/bin/grep -E'
- ENABLE_FUZZING_FALSE=''
- ENABLE_FUZZING_TRUE='#'
- ENABLE_INTEGRATION=''
- ENABLE_INTEGRATION_FALSE=''
- ENABLE_INTEGRATION_TRUE='#'
- ENABLE_TCTI_CMD_FALSE='#'
- ENABLE_TCTI_CMD_TRUE=''
- ENABLE_TCTI_DEVICE_FALSE='#'
- ENABLE_TCTI_DEVICE_TRUE=''
- ENABLE_TCTI_FUZZING_FALSE=''
- ENABLE_TCTI_FUZZING_TRUE='#'
- ENABLE_TCTI_LIBTPMS_FALSE=''
- ENABLE_TCTI_LIBTPMS_TRUE='#'
- ENABLE_TCTI_MSSIM_FALSE='#'
- ENABLE_TCTI_MSSIM_TRUE=''
- ENABLE_TCTI_PCAP_FALSE='#'
- ENABLE_TCTI_PCAP_TRUE=''
- ENABLE_TCTI_SWTPM_FALSE=''
- ENABLE_TCTI_SWTPM_TRUE='#'
- ENABLE_VALGRIND_drd='no'
- ENABLE_VALGRIND_helgrind='no'
- ENABLE_VALGRIND_memcheck='no'
- ENABLE_VALGRIND_sgcheck='no'
- ESYS_FALSE='#'
- ESYS_MBED_FALSE=''
- ESYS_MBED_TRUE='#'
- ESYS_OSSL_FALSE='#'
- ESYS_OSSL_TRUE=''
- ESYS_TRUE=''
- EXEEXT=''
- EXTRA_CFLAGS=' -O2 -std=c99 -Wall -Wextra -Wformat-security -fstack-protector-all -fpic -fPIC -Wno-missing-braces -Wstrict-overflow=5'
- EXTRA_LDFLAGS=' -Wl,--no-undefined -Wl,-z,noexecstack -Wl,-z,now -Wl,-z,relro'
- FAPI_FALSE='#'
- FAPI_TRUE=''
- FGREP='/bin/grep -F'
- FUZZ_LDFLAGS=''
- GCOV=''
- GENERATE_CHI='NO'
- GENERATE_HTML='NO'
- GENERATE_HTMLHELP='NO'
- GENERATE_LATEX='NO'
- GENERATE_MAN='NO'
- GENERATE_RTF='NO'
- GENERATE_XML='NO'
- GENHTML=''
- GREP='/bin/grep'
- HAVE_DOT='NO'
- HAVE_LD_VERSION_SCRIPT_FALSE='#'
- HAVE_LD_VERSION_SCRIPT_TRUE=''
- HHC_PATH=''
- HOSTOS='Linux'
- HOSTOS_LINUX_FALSE='#'
- HOSTOS_LINUX_TRUE=''
- INSTALL_DATA='${INSTALL} -m 644'
- INSTALL_PROGRAM='${INSTALL}'
- INSTALL_SCRIPT='${INSTALL}'
- INSTALL_STRIP_PROGRAM='$(install_sh) -c -s'
- INTEGRATION_ARGS=''
- INTEGRATION_TCTI=''
- JSONC_CFLAGS='-I/opt/ti-processor-sdk-linux-am335x-evm-04.02.00.09/EVSE/GPL/json-c-json-c-0.13.1-20180305/release/include'
- JSONC_LIBS='-L/opt/ti-processor-sdk-linux-am335x-evm-04.02.00.09/EVSE/GPL/json-c-json-c-0.13.1-20180305/release/lib -ljson-c'
- LCOV=''
- LD='/opt/ti-processor-sdk-linux-am335x-evm-04.02.00.09/linux-devkit/sysroots/x86_64-arago-linux/usr/bin/arm-linux-gnueabihf-ld'
- LDFLAGS=''
- LIBADD_DL='-ldl '
- LIBADD_DLD_LINK=''
- LIBADD_DLOPEN='-ldl'
- LIBADD_SHL_LOAD=''
- LIBOBJS=''
- LIBS=''
- LIBSOCKET_LDFLAGS=''
- LIBTOOL='$(SHELL) $(top_builddir)/libtool'
- LIPO=''
- LN_S='ln -s'
- LTLIBOBJS=''
- LT_DLLOADERS=' dlopen.la'
- LT_DLPREOPEN='-dlpreopen dlopen.la '
- LT_SYS_LIBRARY_PATH=''
- MAKEINFO='${SHELL} /opt/ti-processor-sdk-linux-am335x-evm-04.02.00.09/EVSE/GPL/tpm2-tss-3.2.0/missing makeinfo'
- MANIFEST_TOOL=':'
- MKDIR_P='/bin/mkdir -p'
- MOSTLYCLEANFILES += $(valgrind_log_files)
- MOSTLYCLEANFILES ?=
- NM='nm'
- NMEDIT=''
- NO_DL_FALSE=''
- NO_DL_TRUE='#'
- OBJDUMP='objdump'
- OBJEXT='o'
- OTOOL64=''
- OTOOL=''
- PACKAGE='tpm2-tss'
- PACKAGE_BUGREPORT='https://github.com/tpm2-software/tpm2-tss/issues'
- PACKAGE_NAME='tpm2-tss'
- PACKAGE_STRING='tpm2-tss 3.2.0'
- PACKAGE_TARNAME='tpm2-tss'
- PACKAGE_URL='https://github.com/tpm2-software/tpm2-tss'
- PACKAGE_VERSION='3.2.0'
- PAPER_SIZE=''
- PATH='/bin:/sbin:/usr/bin:/opt/ti-processor-sdk-linux-am335x-evm-04.02.00.09/linux-devkit/sysroots/armv7ahf-neon-linux-gnueabi/usr/bin:usr/bin:ATH'
- PATH_SEPARATOR=':'
- PERL_PATH=''
- PKG_CONFIG='/usr/bin/pkg-config'
- PKG_CONFIG_LIBDIR=''
- PKG_CONFIG_PATH=''
- PROJECT='tpm2-tss'
- RANLIB='/opt/ti-processor-sdk-linux-am335x-evm-04.02.00.09/linux-devkit/sysroots/x86_64-arago-linux/usr/bin/arm-linux-gnueabihf-ranlib'
- SANITIZER_CFLAGS=''
- SANITIZER_LDFLAGS=''
- SED='/bin/sed'
- SET_MAKE=''
- SHELL='/bin/bash'
- SRCDIR='.'
- STRIP='/opt/ti-processor-sdk-linux-am335x-evm-04.02.00.09/linux-devkit/sysroots/x86_64-arago-linux/usr/bin/arm-linux-gnueabihf-strip'
- SYSD_SYSUSERS_FALSE='#'
- SYSD_SYSUSERS_TRUE=''
- SYSD_TMPFILES_FALSE='#'
- SYSD_TMPFILES_TRUE=''
- TESTDEVICE_FALSE=''
- TESTDEVICE_TRUE='#'
- TSS2_ESYS_CFLAGS_CRYPTO='-I/opt/ti-processor-sdk-linux-am335x-evm-04.02.00.09/EVSE/GPL/openssl-1.1.1n/release/include'
- TSS2_ESYS_LDFLAGS_CRYPTO='-L/opt/ti-processor-sdk-linux-am335x-evm-04.02.00.09/EVSE/GPL/openssl-1.1.1n/release/lib -lssl -lcrypto'
- UNIT_FALSE=''
- UNIT_TRUE='#'
- VALGRIND=''
- VALGRIND_CHECK_RULES='
- VALGRIND_ENABLED='no'
- VALGRIND_ENABLED_FALSE=''
- VALGRIND_ENABLED_TRUE='#'
- VALGRIND_FLAGS ?= --num-callers=30
- VALGRIND_LOG_COMPILER = \
- VALGRIND_SUPPRESSIONS ?= $(addprefix --suppressions=,$(VALGRIND_SUPPRESSIONS_FILES))
- VALGRIND_TESTS_ENVIRONMENT = \
- VALGRIND_drd_FLAGS ?=
- VALGRIND_helgrind_FLAGS ?= --history-level=approx
- VALGRIND_memcheck_FLAGS ?= --leak-check=full --show-reachable=no
- VALGRIND_sgcheck_FLAGS ?=
- VERSION='3.2.0'
- WITH_UDEVRULESPREFIX_FALSE=''
- WITH_UDEVRULESPREFIX_TRUE='#'
- ac_ct_AR=''
- ac_ct_CC=''
- ac_ct_CXX=''
- ac_ct_DUMPBIN='link -dump'
- addgroup='yes'
- adduser='yes'
- am__EXEEXT_FALSE=''
- am__EXEEXT_TRUE='#'
- am__fastdepCC_FALSE='#'
- am__fastdepCC_TRUE=''
- am__fastdepCXX_FALSE='#'
- am__fastdepCXX_TRUE=''
- am__include='include'
- am__isrc=''
- am__leading_dot='.'
- am__nodep='_no'
- am__quote=''
- am__tar='$${TAR-tar} chof - "$$tardir"'
- am__untar='$${TAR-tar} xf -'
- bindir='${exec_prefix}/bin'
- build='x86_64-pc-linux-gnu'
- build_alias=''
- build_cpu='x86_64'
- build_os='linux-gnu'
- build_vendor='pc'
- check-valgrind-$(1)-am:
- check-valgrind-am:
- datadir='${datarootdir}'
- datarootdir='${prefix}/share'
- define valgrind_tool_rule
- docdir='${datarootdir}/doc/${PACKAGE_TARNAME}'
- dvidir='${docdir}'
- else
- else
- else
- else ifeq ($$(VALGRIND_ENABLED),yes)
- endef
- endif
- endif
- endif
- endif
- exec_prefix='${prefix}'
- groupadd='yes'
- host='arm-unknown-linux-gnueabihf'
- host_alias='arm-linux-gnueabihf'
- host_cpu='arm'
- host_os='linux-gnueabihf'
- host_vendor='unknown'
- htmldir='${docdir}'
- ifGNUmake=''
- ifeq ($$(VALGRIND_ENABLED)-$$(ENABLE_VALGRIND_$(1)),yes-yes)
- ifeq ($(VALGRIND_ENABLED),yes)
- ifnGNUmake=''
- ifneq ($$(TESTS),)
- ifneq ($(LIBTOOL),)
- includedir='${prefix}/include'
- infodir='${datarootdir}/info'
- install_sh='${SHELL} /opt/ti-processor-sdk-linux-am335x-evm-04.02.00.09/EVSE/GPL/tpm2-tss-3.2.0/install-sh'
- libdir='${exec_prefix}/lib'
- libexecdir='${exec_prefix}/libexec'
- localedir='${datarootdir}/locale'
- localstatedir='${prefix}/var'
- mandir='${datarootdir}/man'
- mkdir_p='$(MKDIR_P)'
- oldincludedir='/usr/include'
- pdfdir='${docdir}'
- pkgconfigdir='${libdir}/pkgconfig'
- prefix='/opt/ti-processor-sdk-linux-am335x-evm-04.02.00.09/EVSE/GPL/tpm2-tss-3.2.0/release'
- program_transform_name='s,x,x,'
- psdir='${docdir}'
- result_awk=''
- result_basename=''
- result_cat=''
- result_dirname=''
- result_doxygen=''
- result_echo=''
- result_env=''
- result_expr=''
- result_grep=''
- result_kill=''
- result_mktemp=''
- result_od=''
- result_realpath=''
- result_rm=''
- result_sleep=''
- result_sockstat=''
- result_ss=''
- result_stdbuf=''
- result_swtpm=''
- result_tpm_server=''
- runstatedir='${localstatedir}/run'
- sbindir='${exec_prefix}/sbin'
- sharedstatedir='${prefix}/com'
- sysconfdir='${prefix}/etc'
- systemd_sysusers='yes'
- systemd_tmpfiles='yes'
- sysusersdir='${prefix}/etc/sysusers.d'
- target_alias=''
- tmpfilesdir='${prefix}/etc/tmpfiles.d'
- udevrulesdir='${exec_prefix}/lib/udev/rules.d'
- udevrulesprefix=''
- useradd='yes'
- userstatedir='.local/share'
- valgrind_drd_flags = --tool=drd $(VALGRIND_drd_FLAGS)
- valgrind_enabled_tools=''
- valgrind_helgrind_flags = --tool=helgrind $(VALGRIND_helgrind_FLAGS)
- valgrind_log_files = $(addprefix test-suite-,$(addsuffix .log,$(valgrind_tools)))
- valgrind_lt =
- valgrind_lt = $(LIBTOOL) $(AM_LIBTOOLFLAGS) $(LIBTOOLFLAGS) --mode=execute
- valgrind_memcheck_flags = --tool=memcheck $(VALGRIND_memcheck_FLAGS)
- valgrind_quiet = $(valgrind_quiet_$(V))
- valgrind_quiet_ = $(valgrind_quiet_$(AM_DEFAULT_VERBOSITY))
- valgrind_quiet_0 = --quiet
- valgrind_sgcheck_flags = --tool=exp-sgcheck $(VALGRIND_sgcheck_FLAGS)
- valgrind_tools='memcheck helgrind drd sgcheck'
- valgrind_v_use = $(valgrind_v_use_$(V))
- valgrind_v_use_ = $(valgrind_v_use_$(AM_DEFAULT_VERBOSITY))
- valgrind_v_use_0 = @echo " USE " $(patsubst check-valgrind-%-am,%,$@):;
- ## ----------- ##
- ## confdefs.h. ##
- ## ----------- ##
- /* confdefs.h */
- #define PACKAGE_NAME "tpm2-tss"
- #define PACKAGE_TARNAME "tpm2-tss"
- #define PACKAGE_VERSION "3.2.0"
- #define PACKAGE_STRING "tpm2-tss 3.2.0"
- #define PACKAGE_BUGREPORT "https://github.com/tpm2-software/tpm2-tss/issues"
- #define PACKAGE_URL "https://github.com/tpm2-software/tpm2-tss"
- #define PACKAGE "tpm2-tss"
- #define VERSION "3.2.0"
- #define NDEBUG 1
- #define STDC_HEADERS 1
- #define HAVE_SYS_TYPES_H 1
- #define HAVE_SYS_STAT_H 1
- #define HAVE_STDLIB_H 1
- #define HAVE_STRING_H 1
- #define HAVE_MEMORY_H 1
- #define HAVE_STRINGS_H 1
- #define HAVE_INTTYPES_H 1
- #define HAVE_STDINT_H 1
- #define HAVE_UNISTD_H 1
- #define __EXTENSIONS__ 1
- #define _ALL_SOURCE 1
- #define _GNU_SOURCE 1
- #define _POSIX_PTHREAD_SEMANTICS 1
- #define _TANDEM_SOURCE 1
- #define HAVE_DLFCN_H 1
- #define LT_OBJDIR ".libs/"
- #define HAVE_LIBDL 1
- #define HAVE_DLERROR 1
- #define HAVE_LIBDLLOADER 1
- #define SYSCONFDIR "/opt/ti-processor-sdk-linux-am335x-evm-04.02.00.09/EVSE/GPL/tpm2-tss-3.2.0/release/etc"
- #define OSSL 1
- #define HAVE_EVP_SM3 1
- #define TCTI_DEVICE 1
- #define TCTI_MSSIM 1
- #define TCTI_CMD 1
- #define LOG_FILE_ENABLED 1
- #define MAXLOGLEVEL 6
- #define FAPI_TEST_EK_CERT_LESS 1
- configure: exit 0
|